program: Gaussian 09
title: 000213837
version: EM64L-G09RevD.01
frameworkgroup: C1[X(C13H18N2O3)]
method: RPBEPBE
basis: SDD
operation: Freq
keyword: #p
keyword: freq=noraman
keyword: PBEPBE/SDD
title: #p freq=noraman PBEPBE/SDD
converged: YES YES NO NO
title: Mulliken charges:
elementType: O O O N N C C C C C C C C C C C C C H H H H H H H H H H H H H H H H H H
charge: -0.248777 -0.243243 -0.264314 -0.276621 -0.102837 -0.091831 -0.414292 -0.385910 0.229451 0.416878 -0.611406 -0.611965 -0.321322 -0.359194 -0.359080 -0.369626 0.326626 -0.536766 0.243115 0.265363 0.244277 0.228280 0.221624 0.222217 0.199467 0.228572 0.224190 0.198912 0.230277 0.301401 0.242397 0.251746 0.239398 0.245532 0.219033 0.218426
chargesum: 0.00000
title: Mulliken charges with hydrogens summed into heavy atoms:
elementType: O O O N N C C C C C C C C C C C C C
charge: -0.248777 -0.243243 -0.264314 -0.276621 -0.102837 0.151283 0.095348 0.063994 0.229451 0.416878 0.038850 0.041414 -0.019921 -0.116796 -0.107333 -0.130229 0.326626 0.146225
polarizability: 2.35035555e+02 -1.46971108e+01 1.62405887e+02 1.13010838e+01 1.61136653e+01 1.09525889e+02
1716.lowfreq: -8.7143 -1.3831 -0.0007 -0.0005 -0.0005 2.9619 24.0212 37.7973 43.0747
frequency: 23.9788 37.7738 43.0278 66.4766 79.5968 101.0143 124.6639 137.1029 182.7414 207.5227 216.2863 225.0509 234.4988 252.9551 280.2366 307.2335 334.9023 356.9366 385.2220 390.5033 415.9395 444.1634 450.9798 477.9172 524.4922 540.0786 593.1249 635.0226 670.6545 699.9466 719.0329 734.1402 779.0716 796.3142 822.3786 845.9853 863.5445 905.0734 911.4451 937.0157 976.7287 981.1858 988.4859 1001.7328 1032.1984 1036.4793 1063.4892 1074.0610 1085.2854 1095.1066 1112.7763 1122.6552 1136.8155 1157.2420 1159.2675 1188.8648 1190.4747 1217.1224 1233.0408 1249.5667 1268.9799 1293.3842 1305.2858 1318.4985 1334.0829 1358.4689 1369.2810 1384.7410 1422.4283 1432.5569 1437.4585 1443.4302 1463.3190 1465.1145 1466.6630 1473.6736 1475.5880 1477.3527 1487.1408 1497.4891 1508.5157 1580.5959 1631.8929 1691.6845 2870.3433 2879.0689 2906.7965 2955.0250 2983.7955 3025.1998 3029.5332 3034.6438 3040.8707 3054.2386 3076.1809 3083.0220 3086.4819 3123.5712 3149.0478 3161.6412 3170.0413 3190.5160
redmass: 4.2087 3.6649 2.7475 3.8480 4.8264 2.9219 3.9374 4.6909 3.6061 1.8408 1.2591 4.2145 1.2614 1.4662 2.8957 4.1099 3.5310 5.5344 4.7051 2.1164 3.0636 2.4805 3.0609 3.8920 2.4345 5.1085 6.4566 7.1069 11.4576 8.4096 3.7632 5.1226 6.2182 1.3801 4.6225 1.4878 2.8947 5.2346 1.4408 1.8132 3.1621 1.3313 7.5187 2.9298 1.9272 1.7125 3.0622 1.7937 1.5561 1.6092 1.2607 1.4640 1.4366 1.4474 1.3303 1.3663 4.2915 1.6642 2.3738 1.4907 2.2799 1.5567 1.8442 1.4062 1.4642 3.0201 1.3975 4.5740 1.1401 3.4517 1.1841 1.1543 1.0456 1.0817 1.0501 1.0796 1.0632 1.0564 1.0542 1.1559 2.1885 7.3412 6.2881 11.6813 1.0553 1.0560 1.0676 1.0332 1.0622 1.0751 1.0762 1.0894 1.1037 1.1014 1.0929 1.0993 1.1002 1.0989 1.0867 1.0902 1.0953 1.0954
irintensity: 0.2729 0.5721 0.9062 0.2258 1.8062 4.3035 4.7808 1.5690 0.2771 0.7685 1.4451 12.5543 0.4872 1.1125 2.1271 0.7111 15.1709 0.3650 0.8159 0.3777 0.0659 2.3800 1.8923 0.2944 21.2351 6.9303 46.9781 2.7511 10.5581 2.7002 0.0555 4.9993 7.2850 33.7247 20.8657 64.1210 8.8545 109.9175 7.0854 29.2131 45.1352 2.4670 41.9808 8.8446 41.3113 23.4707 126.5653 84.3311 42.0995 36.4071 0.2271 28.5718 11.2221 11.5337 7.3750 82.7549 141.4321 7.8708 199.3426 0.6236 10.9400 5.3483 32.3784 28.8073 25.5665 113.7016 0.3536 7.6946 3.9309 1.7609 22.5198 2.6887 11.7287 4.5686 13.1124 74.8625 15.4143 23.5198 8.1799 119.0728 261.8581 7.0494 1.9637 436.9689 65.0314 164.7166 99.2874 73.2121 27.3144 30.6560 36.8860 11.9359 52.9566 7.0709 27.9908 52.3376 43.7257 27.5089 17.1840 5.7757 8.8408 6.1434
temp: 298.150 k
press: 1.00000 atm
elementType: 8 8 8 7 7 6 6 6 6 6 6 6 6 6 6 6 6 6 1 1 1 1 1 1 1 1 1 1 1 1 1 1 1 1 1 1
symmnumber: 1
zpe: 773172.0 jmol-1
zpe.correction: 0.294486 hartree
zpe.thermalcorrener: 0.312411 hartree
zpe.thermalcorrenthalpy: 0.313355 hartree
zpe.thermalcorrgfe: 0.247205 hartree
zpe.sumelectzpe: -839.965293 hartree
zpe.sumelectthermal: -839.947368 hartree
zpe.sumelectthermalent: -839.946424 hartree
zpe.sumelectthermalfe: -840.012574 hartree
dipole: -1.7047 -6.8696 -1.5711
dipole: 7.2503
quadrupole: -88.4480 -117.1866 -105.4190
quadrupole: -1.1910 -2.0324 0.1607
quadrupole: 15.2365 -13.5021 -1.7344 -1.1910 -2.0324 0.1607
hfenergy: -840.2597788 hartree
pointgroup: C01 [X(C13H18N2O3)]
dipole: -0.7277766 -2.7484468 -0.2302602 debye
polarizability: 231.2880269|-14.9463251|166.8962034|23.8325705|5.2449488|108.7831009 unknown
InChI: InChI=1S/C13H18N2O3/c1-14(2)8-12-9-15(13(16)18-12)10-4-6-11(17-3)7-5-10/h4-7,12H,8-9H2,1-3H3
charge 0 multiplicity 1
36 atoms
O  -2.280349 1.914844 -0.900489
O  -0.392294 3.05524 -0.128068
O  4.963132 -0.716948 0.784844
N  -0.380041 0.689741 -0.519576
N  -4.000946 -1.311933 0.071457
C  -2.674237 0.482564 -1.042619
C  -1.333506 -0.288926 -1.084463
C  -3.553545 0.096275 0.166034
C  -0.923898 1.980993 -0.468783
C  0.966813 0.332225 -0.200631
C  -5.131213 -1.499241 -0.864909
C  -4.278433 -1.91899 1.392193
C  1.883489 1.274663 0.350566
C  1.408442 -0.995104 -0.430652
C  3.194993 0.883326 0.660113
C  2.729296 -1.387691 -0.117655
C  3.629766 -0.446232 0.432466
C  5.453284 -2.07748 0.561803
H  -3.23115 0.402712 -1.989234
H  -1.414426 -1.202974 -0.471274
H  -1.037851 -0.572493 -2.112775
H  -4.399882 0.82011 0.236984
H  -2.945772 0.214945 1.082792
H  -4.875469 -1.110932 -1.865913
H  -6.065487 -0.986384 -0.525752
H  -5.348655 -2.576884 -0.969441
H  -4.507455 -2.992018 1.26299
H  -5.139659 -1.445784 1.925678
H  -3.386831 -1.835861 2.037968
H  1.562172 2.303977 0.520933
H  0.733917 -1.741463 -0.860197
H  3.90435 1.60144 1.082586
H  3.033633 -2.420818 -0.309731
H  6.500257 -2.065724 0.898737
H  5.410471 -2.351816 -0.510806
H  4.879383 -2.816258 1.15562
