program: Gaussian 09
title: 000213820
version: EM64L-G09RevD.01
frameworkgroup: C1[X(C16H13FN2O)]
method: RPBEPBE
basis: SDD
operation: Freq
keyword: #p
keyword: freq=noraman
keyword: PBEPBE/SDD
title: #p freq=noraman PBEPBE/SDD
converged: YES YES NO NO
title: Mulliken charges:
elementType: F O N N C C C C C C C C C C C C C C C C H H H H H H H H H H H H H
charge: -0.199580 -0.432472 -0.297577 -0.060148 -0.056557 0.342691 0.024379 -0.373249 0.190163 0.425769 -0.493493 -0.559742 -0.361786 -0.380560 -0.409653 0.361829 -0.381398 -0.234356 -0.213087 -0.242431 0.238731 0.238737 0.232530 0.237296 0.289208 0.273882 0.354210 0.248917 0.288744 0.260748 0.229743 0.227963 0.230550
chargesum: 0.00000
title: Mulliken charges with hydrogens summed into heavy atoms:
elementType: F O N N C C C C C C C C C C C C C C C C
charge: -0.199580 -0.078262 -0.297577 -0.060148 -0.056557 0.342691 0.024379 0.104219 0.190163 0.425769 -0.023667 -0.270534 -0.087904 -0.131644 -0.120909 0.361829 -0.120650 -0.004613 0.014875 -0.011881
polarizability: 2.10320112e+02 6.37370637e+00 2.00134069e+02 -1.17418370e+01 -1.45754449e+01 1.42325584e+02
1716.lowfreq: -8.0791 -4.4058 -0.0004 -0.0001 0.0003 6.8097 21.4308 49.8073 54.4413
frequency: 19.9625 49.7930 54.4214 80.5497 129.5722 162.3452 181.0620 194.6376 214.5616 244.0900 251.9083 305.6441 331.0902 348.0996 361.1028 384.7160 402.2632 414.4967 439.8764 493.2268 507.2816 545.5565 601.5332 611.8912 615.9114 643.6975 653.8947 666.1394 704.3145 727.2841 743.3799 756.4449 802.0139 827.1685 835.9763 856.2033 859.9831 886.3453 908.2434 918.7534 932.1359 944.8645 962.5754 970.9174 984.2219 990.4633 994.5804 1002.5979 1026.9092 1074.5188 1078.3358 1098.4839 1120.1459 1134.2383 1152.2641 1168.5273 1173.3197 1182.8132 1190.3235 1204.0658 1224.2844 1249.5532 1271.2530 1299.9845 1306.4711 1329.8783 1350.4840 1384.3964 1402.2161 1429.0679 1435.8449 1461.6962 1468.7194 1481.8542 1499.0427 1594.0282 1596.8805 1611.7860 1619.1624 1646.4825 2973.8740 3001.2379 3058.8069 3076.2018 3120.3979 3130.4215 3144.0735 3161.5940 3162.9606 3176.6573 3182.0819 3183.4008 3554.6850
redmass: 4.0806 5.7669 5.5269 4.7636 2.4615 4.2093 4.9306 4.1719 5.4028 4.7873 3.5956 3.7749 2.9078 4.6391 6.1254 2.3682 2.8518 5.1184 3.1894 3.9052 5.1041 5.6496 5.9803 6.3773 6.2839 4.5517 6.1844 6.1527 2.0079 3.3938 2.6047 3.7690 3.2285 1.7331 1.4466 3.9585 1.2561 1.5991 3.5215 3.8235 1.9777 3.2847 1.3682 3.4117 1.4157 6.0900 5.6752 1.3329 2.2325 1.6360 1.8079 1.8138 1.8585 2.3901 1.8205 1.1817 1.0726 2.5752 1.1772 1.5668 3.1204 1.7460 1.9102 1.3882 1.6290 1.5243 2.4574 8.9603 5.4539 4.4552 2.2210 1.2863 2.3972 2.2697 1.0988 6.3352 8.5069 6.0928 8.0665 9.5083 1.0657 1.0654 1.0963 1.1031 1.0866 1.0877 1.0936 1.0990 1.0896 1.0936 1.0954 1.0974 1.0654
irintensity: 0.1302 0.1323 0.0319 0.1970 1.4857 0.3363 0.0141 9.3963 1.4356 1.7074 5.9299 15.9287 44.7455 4.0959 0.7922 73.1306 1.4420 4.7523 9.8844 3.1241 2.8277 4.6989 6.3216 7.1946 0.4415 7.5413 29.6497 5.6613 33.2265 18.2880 50.8936 33.2850 2.4820 2.7951 23.6931 58.3915 0.5871 27.1882 13.6361 28.8756 4.2778 71.2053 0.3757 27.8166 2.0165 0.5547 28.4020 0.4003 12.2637 1.5125 4.8396 8.2854 9.5458 85.2826 40.0785 6.0004 0.4996 98.4110 4.4278 3.8544 0.3667 52.1737 47.0708 7.5555 18.5826 47.7616 77.6701 2.6681 15.9075 3.7041 20.9202 15.0866 94.0529 14.6139 3.6671 0.1938 57.6475 8.5150 27.1264 85.4787 44.9575 57.1521 28.3892 32.0940 5.1038 2.7935 28.7363 25.7317 1.0878 0.5580 6.3337 3.7354 11.4840
temp: 298.150 k
press: 1.00000 atm
elementType: 9 8 7 7 6 6 6 6 6 6 6 6 6 6 6 6 6 6 6 6 1 1 1 1 1 1 1 1 1 1 1 1 1
symmnumber: 1
zpe: 662200.1 jmol-1
zpe.correction: 0.252219 hartree
zpe.thermalcorrener: 0.268221 hartree
zpe.thermalcorrenthalpy: 0.269166 hartree
zpe.thermalcorrgfe: 0.207899 hartree
zpe.sumelectzpe: -900.664516 hartree
zpe.sumelectthermal: -900.648514 hartree
zpe.sumelectthermalent: -900.647570 hartree
zpe.sumelectthermalfe: -900.708836 hartree
dipole: -1.7440 0.6761 0.2978
dipole: 1.8940
quadrupole: -108.3114 -120.5503 -110.6371
quadrupole: 2.0413 2.0778 4.6846
quadrupole: 4.8548 -7.3841 2.5292 2.0413 2.0778 4.6846
hfenergy: -900.9167352 hartree
pointgroup: C01 [X(C16H13F1N2O1)]
dipole: -0.6201343 0.3989304 0.1075736 debye
polarizability: 211.8991156|3.0434224|196.8106752|-15.5590958|-14.6988722|144.0699753 unknown
InChI: InChI=1S/C16H13FN2O/c17-12-6-7-13-14(10-12)16(20,11-4-2-1-3-5-11)19-9-8-18-15(13)19/h1-7,10,20H,8-9H2
charge 0 multiplicity 1
33 atoms
F  2.875322 -3.56088 0.199007
O  -0.499251 0.135129 2.391821
N  0.002595 1.664608 0.559728
N  1.38604 2.92845 -0.821391
C  -0.33266 0.280166 0.936094
C  0.94042 -0.445376 0.436345
C  1.168961 1.772127 -0.238328
C  -0.826548 2.867828 0.342714
C  1.812136 0.449274 -0.244496
C  -1.628467 -0.240561 0.294585
C  0.229282 3.803145 -0.378599
C  1.273461 -1.798287 0.602696
C  3.036093 0.00861 -0.78379
C  -1.765312 -0.180291 -1.115674
C  -2.681842 -0.769428 1.075312
C  2.504082 -2.209629 0.05523
C  3.388933 -1.351423 -0.630752
C  -2.944083 -0.643675 -1.737325
C  -3.862397 -1.233552 0.450224
C  -3.998161 -1.172526 -0.955048
H  -1.190832 3.296084 1.291013
H  -1.698815 2.641476 -0.302892
H  0.618481 4.574014 0.313308
H  -0.197333 4.31933 -1.255032
H  0.620628 -2.505541 1.120898
H  3.695507 0.705456 -1.308817
H  0.299707 0.538589 2.819244
H  -0.948522 0.220274 -1.728892
H  -2.565838 -0.808415 2.161163
H  4.32575 -1.75158 -1.028527
H  -3.040456 -0.595087 -2.827645
H  -4.674598 -1.642749 1.061514
H  -4.913183 -1.534157 -1.437388
