program: Gaussian 09
title: 000213813
version: EM64L-G09RevD.01
frameworkgroup: C1[X(C16H27NO)]
method: RPBEPBE
basis: SDD
operation: Freq
keyword: #p
keyword: freq=noraman
keyword: PBEPBE/SDD
title: #p freq=noraman PBEPBE/SDD
converged: YES YES NO NO
title: Mulliken charges:
elementType: O N C C C C C C C C C C C C C C C C H H H H H H H H H H H H H H H H H H H H H H H H H H H
charge: -0.298309 -0.109702 0.054993 -0.386845 -0.227961 -0.306590 -0.337147 -0.323679 -0.711008 0.540531 -0.758610 -0.705743 -0.675633 -0.398219 -0.467921 -0.242435 -0.218242 -0.246895 0.198965 0.207036 0.191982 0.218697 0.181895 0.231633 0.177106 0.257174 0.182910 0.205363 0.206998 0.223443 0.221582 0.194433 0.220806 0.276404 0.209518 0.204535 0.237706 0.205669 0.205396 0.226845 0.226407 0.234283 0.222038 0.223731 0.226858
chargesum: 0.00000
title: Mulliken charges with hydrogens summed into heavy atoms:
elementType: O N C C C C C C C C C C C C C C C C
charge: -0.298309 -0.109702 0.253958 0.012173 -0.009264 0.106938 0.097134 0.064594 -0.058985 0.540531 -0.066966 -0.053983 -0.037722 -0.171811 -0.233638 -0.020398 0.005490 -0.020038
polarizability: 2.36259754e+02 -3.97821496e+00 1.64956255e+02 -2.72046620e+00 1.79744115e+01 1.52661890e+02
1716.lowfreq: -15.8488 -7.4738 -0.0009 -0.0008 -0.0005 3.2076 16.6109 22.6916 32.0019
frequency: 13.6821 21.2591 31.6447 42.7597 56.7828 72.9598 81.8345 83.5604 92.6423 156.2447 198.7201 206.2575 213.1445 213.9446 230.9595 251.6517 270.3043 280.7165 293.6613 301.6920 319.4901 346.9032 351.3156 404.6082 430.1919 446.9571 477.2793 500.7359 519.9102 537.6108 598.2775 616.7213 706.7997 742.7053 754.6309 765.4305 790.5728 797.4529 804.3009 852.3657 873.6115 877.6359 899.6032 911.1349 920.6053 936.3267 974.2057 989.5900 992.4180 993.0131 1003.7901 1015.5547 1032.8596 1045.6223 1068.4089 1075.0448 1075.8215 1085.8263 1094.7117 1110.8087 1114.0216 1135.3571 1147.2927 1171.1804 1181.0773 1188.8739 1203.3856 1206.4035 1245.1507 1271.1538 1275.5171 1282.3561 1289.7420 1300.9587 1324.0767 1331.1105 1343.6526 1359.5440 1365.3303 1370.6389 1378.8857 1382.1646 1383.2541 1385.4936 1388.8579 1395.8505 1439.6005 1448.2820 1457.3035 1464.5428 1465.6888 1470.0218 1472.8153 1474.6846 1476.1100 1476.5444 1484.2670 1484.4913 1490.5739 1502.8394 1590.8460 1611.8371 2839.0454 2850.2301 2904.4354 2954.6551 2968.1200 2974.9319 2978.3780 2978.9549 2981.4495 2992.8063 3029.4359 3040.0524 3040.1403 3055.6757 3063.6193 3071.5982 3073.1483 3075.4952 3076.6798 3084.0052 3087.1507 3089.5001 3114.5343 3116.8406 3131.5619 3142.0791 3160.7927
redmass: 3.3991 3.4878 3.6139 3.3418 3.5314 2.7689 2.2871 2.8038 2.2203 1.8921 1.9112 1.7989 1.6545 1.9039 1.8996 2.3114 2.1322 2.2447 1.1031 2.0440 2.9070 3.1805 2.5938 2.8133 2.6059 2.9432 2.5074 2.4263 2.9482 2.8412 4.1354 6.4071 1.6792 2.8327 3.0648 2.2053 2.0572 1.3588 1.1905 1.2468 1.6314 2.5549 1.8718 1.3847 1.4066 1.7530 1.3914 5.1116 2.4726 1.5083 3.1459 2.1327 1.7568 2.2853 2.5428 1.8612 2.0669 1.9709 2.2279 2.1585 1.9299 2.1250 1.7778 1.0616 2.1758 1.1120 2.3527 1.9194 1.4117 1.4767 1.1926 1.3167 1.1934 1.2923 1.2643 1.2107 1.3085 1.3565 1.3101 1.3644 1.2743 2.1390 1.9118 1.2525 1.2731 1.2064 2.1473 1.0772 1.0829 1.0523 1.0574 1.0596 1.0635 1.0759 1.0599 1.2317 1.1524 1.4364 1.0790 1.0553 5.9340 6.1215 1.0720 1.0716 1.0686 1.0615 1.0372 1.0704 1.0389 1.0433 1.0361 1.0828 1.0905 1.0967 1.0939 1.0919 1.0991 1.0978 1.0981 1.1006 1.0943 1.1000 1.1002 1.0995 1.0857 1.0867 1.0910 1.0959 1.1014
irintensity: 0.0803 0.1391 0.0410 0.6058 0.3911 0.9997 0.0872 0.0859 0.1632 2.8621 0.2511 1.4755 1.7046 0.3224 3.3506 1.8449 0.4103 0.3279 0.6400 3.2748 1.9674 1.0889 4.6564 0.0110 2.4778 4.2913 3.5826 7.1284 3.2501 22.8550 2.8435 0.1403 54.0579 14.5714 9.4203 23.0829 17.1063 0.2711 7.9024 0.0390 4.4080 5.2765 4.7566 0.8180 4.5278 0.1645 0.0725 0.6808 25.6394 8.1903 139.1041 27.1937 2.3609 100.5838 21.3104 9.6656 22.1817 7.2223 14.6641 3.8346 8.4505 47.8031 2.5257 0.3831 8.6380 0.0486 27.4417 3.2794 5.0396 0.7157 7.1649 12.4319 17.0338 4.3490 5.3911 16.0461 4.4253 4.7674 2.5530 6.3831 2.0009 12.3000 12.9503 20.0168 16.5665 13.5873 8.4555 1.3301 2.4714 9.0753 2.0707 10.0104 8.5277 4.0355 7.8703 0.9300 6.9679 31.0974 5.1899 15.4618 1.7122 10.6819 46.6331 210.3195 76.6860 37.6371 9.4168 45.3499 8.6183 47.9620 27.6718 22.2673 24.8657 19.2768 23.7110 6.3766 28.2413 73.0121 24.1675 18.4974 54.7929 33.1923 42.2567 50.8863 9.7457 4.2580 13.7738 48.3498 26.4697
temp: 298.150 k
press: 1.00000 atm
elementType: 8 7 6 6 6 6 6 6 6 6 6 6 6 6 6 6 6 6 1 1 1 1 1 1 1 1 1 1 1 1 1 1 1 1 1 1 1 1 1 1 1 1 1 1 1
symmnumber: 1
zpe: 1040526.0 jmol-1
zpe.correction: 0.396315 hartree
zpe.thermalcorrener: 0.417180 hartree
zpe.thermalcorrenthalpy: 0.418124 hartree
zpe.thermalcorrgfe: 0.344014 hartree
zpe.sumelectzpe: -754.415989 hartree
zpe.sumelectthermal: -754.395124 hartree
zpe.sumelectthermalent: -754.394180 hartree
zpe.sumelectthermalfe: -754.468291 hartree
dipole: -0.7162 0.8633 0.4596
dipole: 1.2122
quadrupole: -103.2344 -108.9934 -113.3118
quadrupole: -0.8206 -0.8277 5.3646
quadrupole: 5.2788 -0.4801 -4.7986 -0.8206 -0.8277 5.3646
hfenergy: -754.8123042 hartree
pointgroup: C01 [X(C16H27N1O1)]
dipole: 0.2790278 -0.2390658 0.3040321 debye
polarizability: 233.1046353|-17.5708616|148.6492391|-4.1211849|-12.5502488|172.1240256 unknown
InChI: InChI=1S/C16H27NO/c1-5-17(6-2)12-15(4)18-13-14(3)16-10-8-7-9-11-16/h7-11,14-15H,5-6,12-13H2,1-4H3
charge 0 multiplicity 1
45 atoms
O  0.520669 -1.306384 -0.533447
N  3.238728 -0.045739 -0.531741
C  1.553881 -1.669106 0.464559
C  2.924109 -1.462595 -0.210327
C  -1.080435 0.565273 -0.109018
C  -0.798598 -0.959173 0.015238
C  2.853983 0.304384 -1.930815
C  4.637099 0.32982 -0.19027
C  1.363603 -3.127282 0.92704
C  -2.549607 0.838866 0.221345
C  -0.097883 1.39854 0.748978
C  2.713741 1.81892 -2.173489
C  4.861922 0.482461 1.326512
C  -3.041617 0.71103 1.548074
C  -3.466737 1.192904 -0.801389
C  -4.40459 0.93515 1.842795
C  -4.83191 1.420534 -0.511918
C  -5.306911 1.291669 0.813198
H  1.482414 -0.975864 1.328699
H  2.961312 -2.10578 -1.121359
H  3.688808 -1.855984 0.486152
H  -0.910731 0.825013 -1.17303
H  -0.881142 -1.271713 1.078001
H  -1.547321 -1.52426 -0.571085
H  3.581486 -0.126133 -2.667569
H  1.878903 -0.177679 -2.112605
H  5.374839 -0.402011 -0.609923
H  4.851747 1.29993 -0.672607
H  2.093984 -3.391817 1.715165
H  1.495634 -3.820576 0.076699
H  0.350467 -3.283653 1.339231
H  -0.220309 1.18255 1.827736
H  -0.275916 2.479662 0.604959
H  0.946353 1.171403 0.467859
H  2.344828 2.002453 -3.200081
H  3.671809 2.359666 -2.066865
H  1.993222 2.254754 -1.459564
H  5.904251 0.789221 1.534841
H  4.677942 -0.463016 1.869479
H  4.178429 1.247308 1.735343
H  -2.354244 0.445944 2.360853
H  -3.104366 1.294833 -1.83223
H  -4.763953 0.833711 2.873521
H  -5.521697 1.698765 -1.317122
H  -6.364096 1.468406 1.041373
