program: Gaussian 09
title: 000213802
version: EM64L-G09RevD.01
frameworkgroup: C1[X(C12H13Cl3N2)]
method: RPBEPBE
basis: SDD
operation: Freq
keyword: #p
keyword: freq=noraman
keyword: PBEPBE/SDD
title: #p freq=noraman PBEPBE/SDD
converged: YES YES NO NO
title: Mulliken charges:
elementType: Cl Cl Cl N N C C C C C C C C C C C C H H H H H H H H H H H H H
charge: -0.058190 -0.021074 -0.014235 -0.157166 -0.097584 -0.363503 -0.456708 -0.500987 0.176318 -0.352419 -0.670482 0.440367 -0.317617 -0.366764 -0.052495 -0.206111 -0.109762 0.227307 0.224108 0.236367 0.231112 0.256349 0.254649 0.254981 0.205226 0.210726 0.249297 0.221150 0.278534 0.278606
chargesum: 0.00000
title: Mulliken charges with hydrogens summed into heavy atoms:
elementType: Cl Cl Cl N N C C C C C C C C C C C C
charge: -0.058190 -0.021074 -0.014235 -0.157166 -0.097584 0.087912 0.010770 0.010011 0.176318 0.107789 0.010690 0.440367 -0.317617 -0.088229 -0.052495 0.072495 -0.109762
polarizability: 2.79736690e+02 -4.98586373e+00 1.56599130e+02 3.38539161e+00 4.67729120e+00 1.11142027e+02
1716.lowfreq: -6.3023 -4.0958 -0.0031 -0.0022 -0.0010 8.1605 31.5162 37.5573 47.8754
frequency: 31.1020 37.4765 47.8356 54.0189 87.6292 122.9317 132.6726 147.0341 168.1953 177.0038 186.3165 203.2525 216.8824 248.5883 281.6809 308.0727 338.8804 371.4977 381.7844 435.8821 461.2822 498.3577 526.1736 568.8393 579.4895 596.4786 623.8186 655.8807 675.4539 706.4365 741.2039 783.8037 845.5582 854.0119 867.1033 874.6435 905.4633 930.1335 942.3751 1001.6413 1025.6606 1047.3820 1074.1802 1083.0412 1110.4732 1125.4182 1162.8512 1188.7032 1212.7329 1220.0753 1226.9337 1248.6449 1282.8778 1286.9605 1306.1515 1314.6538 1324.9746 1355.8813 1364.9988 1389.3875 1420.6988 1449.2350 1456.4620 1471.7268 1473.5283 1478.2889 1483.7316 1504.8008 1526.3510 1582.8321 1665.7205 2954.3479 2986.8671 2997.6988 3009.7939 3020.6366 3036.7951 3062.7504 3077.8310 3084.8592 3098.1074 3098.5188 3176.2510 3178.4530
redmass: 5.1451 5.0315 6.9073 3.3681 6.8903 2.7769 2.7007 6.6636 3.9220 18.8594 1.9552 2.7730 4.0439 1.7975 11.0141 18.7331 10.4844 3.6164 3.6395 3.1224 6.3960 4.9078 3.8495 5.9280 6.2773 3.3382 4.9652 6.0075 3.4119 4.1679 4.3501 1.1943 1.4836 2.0036 1.4809 2.3018 2.0736 2.4890 2.5110 2.5349 3.2458 2.8381 1.7593 1.9741 2.0047 1.7139 1.3383 2.1918 1.5652 1.4693 1.2287 2.8696 2.2565 1.4707 1.6353 1.9366 1.7367 1.2803 7.5497 1.2119 2.8353 1.4049 1.0779 1.4532 1.0864 1.2175 1.0598 1.2683 9.5665 8.4552 10.1213 1.0658 1.0356 1.0623 1.0628 1.0723 1.0881 1.1005 1.0992 1.0994 1.1045 1.1020 1.0920 1.0931
irintensity: 0.5300 0.2540 0.8694 1.0366 0.5165 1.6641 0.4754 0.5983 1.2778 0.1525 4.5720 0.4260 0.7140 0.4646 1.5836 0.8912 0.2560 0.7303 8.8024 12.4694 6.9708 4.3604 7.1376 24.5280 19.0094 17.5269 3.0009 26.5234 1.7497 19.1469 1.1180 21.1273 0.2587 8.6543 39.1745 15.3690 8.6233 11.2267 8.4535 20.0283 55.5442 21.2240 5.0084 29.8561 46.2561 18.6235 1.7557 37.2989 6.6908 11.6927 2.8679 20.3160 217.4615 12.1121 11.0355 32.3790 25.4070 4.7660 28.6939 19.2918 241.2509 4.1691 15.7978 5.6514 12.4499 8.4202 7.9573 7.7496 15.8499 78.9628 1149.6136 81.5887 31.8413 52.3267 8.7024 14.4061 59.6430 2.5597 8.6112 36.1986 32.5170 36.8729 0.5961 0.2895
temp: 298.150 k
press: 1.00000 atm
elementType: 17 17 17 7 7 6 6 6 6 6 6 6 6 6 6 6 6 1 1 1 1 1 1 1 1 1 1 1 1 1
symmnumber: 1
zpe: 593737.5 jmol-1
zpe.correction: 0.226143 hartree
zpe.thermalcorrener: 0.243412 hartree
zpe.thermalcorrenthalpy: 0.244357 hartree
zpe.thermalcorrgfe: 0.178925 hartree
zpe.sumelectzpe: -1953.500383 hartree
zpe.sumelectthermal: -1953.483113 hartree
zpe.sumelectthermalent: -1953.482169 hartree
zpe.sumelectthermalfe: -1953.547601 hartree
dipole: -6.4627 -0.4200 1.8434
dipole: 6.7336
quadrupole: -113.1807 -120.8061 -118.1217
quadrupole: 6.0700 -3.0420 0.4531
quadrupole: 4.1888 -3.4366 -0.7522 6.0700 -3.0420 0.4531
hfenergy: -1953.7265258 hartree
pointgroup: C01 [X(C12H13Cl3N2)]
dipole: -2.4400737 -0.6282465 0.8183192 debye
polarizability: 277.1422844|0.8553302|136.1267207|-20.2641267|23.1491993|134.2088411 unknown
InChI: InChI=1S/C12H13Cl3N2/c1-2-17-5-3-4-12(17)16-11-7-9(14)8(13)6-10(11)15/h6-7H,2-5H2,1H3
charge 0 multiplicity 1
30 atoms
Cl 0.028594 2.215324 1.426151
Cl 4.026644 -1.487963 -1.9945
Cl 5.202427 0.825262 0.052157
N  -2.991796 -0.558264 -0.059325
N  -0.776637 -0.009394 -0.649014
C  -3.78732 -1.0679 1.078239
C  -2.730666 -1.811374 1.939495
C  -1.403368 -1.07459 1.614618
C  -1.640198 -0.492273 0.217216
C  -3.596193 0.058666 -1.249248
C  -4.013884 1.529549 -1.01962
C  0.590116 0.145761 -0.405443
C  1.14466 1.134104 0.464623
C  1.529079 -0.630625 -1.149662
C  2.914271 -0.440832 -1.015894
C  2.527788 1.339674 0.600588
C  3.423845 0.542706 -0.140751
H  -4.592691 -1.734114 0.718543
H  -4.258068 -0.234545 1.641088
H  -2.666025 -2.866724 1.622052
H  -2.980286 -1.789423 3.01267
H  -0.518089 -1.731686 1.631392
H  -1.21294 -0.241909 2.317507
H  -2.840923 0.009603 -2.053039
H  -4.468689 -0.551203 -1.552162
H  -4.769359 1.618642 -0.217754
H  -3.134242 2.136705 -0.74468
H  -4.448639 1.950204 -1.944437
H  1.141402 -1.38111 -1.843013
H  2.910585 2.110732 1.273705
