program: Gaussian 09
title: 000213780
version: EM64L-G09RevD.01
frameworkgroup: C1[X(C13H16ClFN2)]
method: RPBEPBE
basis: SDD
operation: Freq
keyword: #p
keyword: freq=noraman
keyword: PBEPBE/SDD
title: #p freq=noraman PBEPBE/SDD
converged: YES YES NO NO
title: Mulliken charges:
elementType: Cl F N N C C C C C C C C C C C C C H H H H H H H H H H H H H H H H
charge: -0.037234 -0.189841 -0.165699 -0.105446 -0.362682 -0.466299 -0.500598 0.157215 -0.356863 -0.358065 -0.677311 0.286580 -0.308608 -0.378383 -0.287300 -0.319242 0.372199 0.226539 0.222108 0.236982 0.230578 0.267916 0.229162 0.253440 0.198221 0.197532 0.224203 0.219170 0.206476 0.222120 0.252480 0.256409 0.254241
chargesum: 0.00000
title: Mulliken charges with hydrogens summed into heavy atoms:
elementType: Cl F N N C C C C C C C C C C C C C
charge: -0.037234 -0.189841 -0.165699 -0.105446 0.085964 0.001262 -0.003520 0.157215 0.094798 0.063670 -0.029545 0.286580 -0.056128 -0.121974 -0.287300 -0.065001 0.372199
polarizability: 2.59743856e+02 1.11491718e+01 1.51738306e+02 -4.24541730e+00 2.19485733e+01 1.19652254e+02
1716.lowfreq: -8.7188 -6.7256 -0.0006 0.0022 0.0024 2.2412 16.0606 20.9353 51.9730
frequency: 15.7208 20.8752 51.9008 61.1298 72.7465 95.7838 128.8614 148.2553 178.8332 194.4313 203.3040 216.8509 237.1812 282.1600 283.6026 347.1291 351.3229 399.3749 413.7726 437.4405 480.0861 521.7256 551.9384 584.3077 620.0718 635.9914 681.9145 690.5192 725.3554 744.8944 774.0528 810.9837 840.2389 857.5514 861.5541 874.5673 890.4650 904.9141 934.6905 939.6240 1003.3766 1015.8423 1038.4634 1049.8404 1071.0283 1107.0902 1121.2565 1122.9463 1160.4803 1179.5720 1198.4539 1213.2652 1221.6647 1241.3706 1255.4115 1266.9658 1283.0409 1296.9810 1300.8326 1310.6249 1323.5976 1337.5166 1362.3726 1391.1602 1398.7867 1424.5289 1453.2907 1454.5271 1473.1209 1474.9699 1477.8557 1482.8934 1485.2300 1503.2876 1559.6690 1605.2538 1641.9313 2950.7719 2973.9869 2977.1304 2982.6941 2999.7720 3018.1770 3032.9993 3033.3433 3060.6249 3076.1282 3077.2715 3080.5740 3096.1499 3158.9057 3171.9701 3180.0546
redmass: 5.6222 3.2945 2.4560 3.9321 3.7538 3.0947 3.2620 4.6811 2.8675 2.2286 8.1834 1.5795 2.3451 4.6942 3.9101 5.1270 5.3491 4.5629 5.8435 3.2413 5.6617 3.1220 5.3857 5.0194 2.7855 5.2901 6.3861 3.4481 4.0021 1.1037 4.2796 1.4003 1.5541 1.8472 1.7643 1.7316 1.8568 2.1881 2.2342 1.3400 2.3070 3.1023 2.7847 2.8472 1.6811 2.1568 1.2874 1.5784 1.4024 2.1097 1.6042 2.2760 1.3888 1.5115 1.7045 1.8212 1.6032 1.2642 1.4045 1.3388 1.8031 4.6948 1.3662 1.2083 5.2909 2.4562 1.0943 1.1572 1.0671 1.1253 1.0679 2.1083 1.0738 1.2738 7.9419 7.7205 9.6206 1.0662 1.0603 1.0380 1.0632 1.0654 1.0738 1.0876 1.0938 1.1000 1.1015 1.0971 1.0996 1.1046 1.0881 1.0915 1.0973
irintensity: 0.2058 0.0938 0.4535 0.8753 1.1084 1.0961 0.5734 0.9627 1.0988 0.9905 0.8457 0.2921 1.4353 3.9641 0.4644 3.7278 1.7196 2.8264 3.6061 6.5922 8.9928 3.3979 14.5756 4.2896 18.0844 2.6920 28.9015 4.3160 23.5404 12.6484 16.4760 34.0686 38.4495 16.8840 2.2050 12.1686 11.5689 5.3220 5.2687 0.1466 22.0420 24.9535 9.5414 7.3490 1.8121 12.1395 11.2978 24.2588 8.9449 81.9638 25.0071 20.9483 14.0419 6.5109 0.2876 68.6572 100.6035 33.1476 15.8726 17.0525 16.0024 3.7396 4.0533 11.2987 0.7999 177.5017 17.6418 15.9364 0.8379 25.2126 4.2393 96.8393 15.3420 29.7769 29.8497 121.4556 994.1194 84.9833 35.2016 59.0329 44.1048 17.8739 13.9100 36.5442 29.8805 0.8864 70.0711 8.2251 43.1783 34.4456 4.9322 4.4627 3.6165
temp: 298.150 k
press: 1.00000 atm
elementType: 17 9 7 7 6 6 6 6 6 6 6 6 6 6 6 6 6 1 1 1 1 1 1 1 1 1 1 1 1 1 1 1 1
symmnumber: 1
zpe: 695300.6 jmol-1
zpe.correction: 0.264826 hartree
zpe.thermalcorrener: 0.281868 hartree
zpe.thermalcorrenthalpy: 0.282812 hartree
zpe.thermalcorrgfe: 0.217103 hartree
zpe.sumelectzpe: -1173.115618 hartree
zpe.sumelectthermal: -1173.098576 hartree
zpe.sumelectthermalent: -1173.097632 hartree
zpe.sumelectthermalfe: -1173.163341 hartree
dipole: 6.8295 1.9349 -0.8928
dipole: 7.1542
quadrupole: -114.3057 -100.6521 -106.3332
quadrupole: 5.3423 2.9006 1.3931
quadrupole: -7.2087 6.4449 0.7638 5.3423 2.9006 1.3931
hfenergy: -1173.380444 hartree
pointgroup: C01 [X(C13H16Cl1F1N2)]
dipole: -2.6590872 -0.8886263 0.2491473 debye
polarizability: 258.7231317|17.4836804|113.4692755|-1.8134115|-13.4675272|158.942009 unknown
InChI: InChI=1S/C13H16ClFN2/c1-2-7-17-8-3-4-13(17)16-10-5-6-12(15)11(14)9-10/h5-6,9H,2-4,7-8H2,1H3
charge 0 multiplicity 1
33 atoms
Cl 4.009662 0.491073 2.156056
F  5.111002 0.589825 -0.677935
N  -2.618569 -0.718936 0.180115
N  -0.504832 -0.003111 -0.57328
C  -3.257877 -1.626427 1.153719
C  -2.109556 -2.600125 1.53003
C  -0.828172 -1.748891 1.326708
C  -1.232853 -0.735673 0.242616
C  -3.38035 0.193675 -0.680186
C  -3.915637 1.442547 0.064136
C  -4.720039 2.363125 -0.87763
C  0.897211 0.090782 -0.534886
C  1.661504 0.188566 0.670144
C  1.589661 0.188552 -1.779677
C  3.056347 0.355103 0.614577
C  2.987226 0.343972 -1.825863
C  3.717153 0.424148 -0.625315
H  -4.121009 -2.140915 0.691872
H  -3.628847 -1.070026 2.040365
H  -2.106205 -3.459749 0.837062
H  -2.208732 -2.986135 2.557695
H  0.054177 -2.3351 1.021252
H  -0.562398 -1.214724 2.258819
H  -2.697393 0.509341 -1.48923
H  -4.226192 -0.363727 -1.132059
H  -4.554563 1.128691 0.913745
H  -3.056433 1.994347 0.490132
H  -4.09491 2.710441 -1.721158
H  -5.596924 1.837447 -1.301174
H  -5.089351 3.255979 -0.342198
H  1.166724 0.173028 1.644794
H  1.002942 0.14086 -2.701112
H  3.523632 0.410839 -2.777135
