program: Gaussian 09
title: 000213779
version: EM64L-G09RevD.01
frameworkgroup: C1[X(C14H18ClFN2)]
method: RPBEPBE
basis: SDD
operation: Freq
keyword: #p
keyword: freq=noraman
keyword: PBEPBE/SDD
title: #p freq=noraman PBEPBE/SDD
converged: YES YES NO NO
title: Mulliken charges:
elementType: Cl F N N C C C C C C C C C C C C C C H H H H H H H H H H H H H H H H H H
charge: -0.037147 -0.189793 -0.158865 -0.097183 -0.358723 -0.466741 -0.501519 0.150589 -0.393132 -0.348570 -0.335927 -0.688322 0.284419 -0.307869 -0.378939 -0.287795 -0.319395 0.372104 0.220573 0.227193 0.230971 0.236539 0.229207 0.267792 0.194826 0.242672 0.234261 0.190606 0.185166 0.199697 0.215190 0.214907 0.209123 0.253393 0.256391 0.254300
chargesum: 0.00000
title: Mulliken charges with hydrogens summed into heavy atoms:
elementType: Cl F N N C C C C C C C C C C C C C C
charge: -0.037147 -0.189793 -0.158865 -0.097183 0.089043 0.000768 -0.004520 0.150589 0.044367 0.076298 0.048936 -0.049102 0.284419 -0.054476 -0.122548 -0.287795 -0.065095 0.372104
polarizability: 2.65422847e+02 -1.88727415e+01 1.36519089e+02 5.40004085e+00 1.86009686e+01 1.58992184e+02
1716.lowfreq: -6.5868 -2.9831 -0.0014 -0.0011 -0.0003 3.7552 16.1708 22.0257 52.6239
frequency: 15.7435 22.0018 52.5756 65.3400 74.7930 80.4188 122.2377 131.9174 154.1278 164.8844 192.8027 203.2902 215.4147 237.2907 266.0874 285.6093 318.4744 349.0471 399.6996 403.0859 437.5293 469.8044 482.4752 525.2532 547.5879 582.0548 605.3466 625.0587 670.4915 688.4093 714.9924 747.4723 770.4889 810.2708 811.3290 838.5464 855.2681 863.6211 878.5619 903.9695 923.2393 939.1960 941.5799 981.1187 1015.3017 1016.3244 1038.6017 1064.2094 1073.2839 1114.4308 1121.2591 1126.9937 1157.0843 1175.6738 1195.3756 1204.6776 1218.6165 1232.7135 1239.9345 1252.0421 1280.3378 1282.0519 1286.9648 1300.4492 1314.2029 1328.6390 1338.8132 1343.7653 1365.1977 1391.9057 1398.9741 1419.9635 1448.3772 1454.2267 1460.8964 1473.5988 1473.9452 1478.6775 1483.4068 1486.4674 1504.3572 1559.7562 1605.1391 1638.1665 2957.0446 2962.5407 2974.4809 2975.1539 2987.6080 2998.7081 3009.2260 3017.6323 3033.1103 3043.1777 3057.1573 3072.6064 3074.1699 3078.0712 3095.3565 3158.6981 3170.1834 3179.7379
redmass: 4.7794 4.8669 3.3128 3.6449 4.1238 2.1655 3.1651 2.9813 4.1864 3.4758 2.3338 5.5780 6.6452 1.1396 2.5687 5.5591 4.1094 7.3044 3.0560 7.2095 3.1987 4.1482 3.3121 3.6942 4.2497 4.3168 2.9830 4.1489 4.1616 3.5718 3.6873 1.2517 4.2997 1.4500 1.8698 1.5795 1.7318 2.5651 1.5878 2.2233 1.7464 1.3487 1.8804 2.1701 2.5266 2.5673 2.6499 2.2311 1.7631 2.1931 1.2765 1.6121 1.3898 2.4667 1.4696 2.2377 1.2915 1.4550 1.6570 1.9259 1.4602 1.3690 1.3465 1.5488 1.3119 1.9435 3.5638 1.4966 1.3470 1.2108 5.3348 2.1783 1.1925 1.1501 1.0786 1.0677 1.1227 1.0422 2.2548 1.0803 1.2446 7.9699 7.7332 9.2392 1.0637 1.0607 1.0577 1.0414 1.0599 1.0659 1.0966 1.0731 1.0872 1.1008 1.1032 1.1006 1.0996 1.0971 1.1046 1.0881 1.0915 1.0973
irintensity: 0.1637 0.0445 0.2376 1.5263 0.4550 0.5413 1.0631 0.3233 1.4203 1.1397 3.2909 0.7273 0.9209 0.1779 0.9516 2.3890 1.8419 0.3410 0.5413 4.3605 5.8588 5.7277 4.1989 4.4577 16.8247 2.9319 8.0165 9.3972 10.4295 8.1633 42.0121 4.4558 20.5286 32.3198 3.1056 38.5812 6.2822 17.1992 7.7254 6.8571 14.6539 0.6429 13.2213 3.5086 20.2564 10.9822 5.3950 8.0020 0.2658 3.2009 8.9411 3.8794 1.6035 108.1713 13.5126 28.5443 11.3241 13.5789 5.1770 19.2447 1.8549 67.1027 57.9435 63.7817 4.3195 18.3148 4.1783 25.7069 16.5658 10.1869 0.9960 153.4058 50.3637 14.5315 2.8495 3.4004 24.0026 11.4260 84.1274 17.9739 27.3205 29.2880 132.8307 941.7904 58.8629 60.5958 23.8203 55.9768 54.7216 17.1247 10.0032 15.7069 52.2845 21.3488 29.7267 84.6285 51.9462 8.2377 34.4789 4.8914 4.3210 3.8143
temp: 298.150 k
press: 1.00000 atm
elementType: 17 9 7 7 6 6 6 6 6 6 6 6 6 6 6 6 6 6 1 1 1 1 1 1 1 1 1 1 1 1 1 1 1 1 1 1
symmnumber: 1
zpe: 769067.1 jmol-1
zpe.correction: 0.292922 hartree
zpe.thermalcorrener: 0.311151 hartree
zpe.thermalcorrenthalpy: 0.312095 hartree
zpe.thermalcorrgfe: 0.243960 hartree
zpe.sumelectzpe: -1212.337387 hartree
zpe.sumelectthermal: -1212.319159 hartree
zpe.sumelectthermalent: -1212.318214 hartree
zpe.sumelectthermalfe: -1212.386350 hartree
dipole: -6.6524 2.4457 -0.7030
dipole: 7.1225
quadrupole: -123.5072 -109.1528 -111.0789
quadrupole: -3.3713 -4.2112 2.4601
quadrupole: -8.9276 5.4268 3.5007 -3.3713 -4.2112 2.4601
hfenergy: -1212.6303094 hartree
pointgroup: C01[X(C14H18Cl1F1N2)]
dipole: -2.5413414 1.090323 0.4529485 debye
polarizability: 261.9266765|-27.8917523|132.3383899|-9.4451766|-9.8997093|166.6690538 unknown
InChI: InChI=1S/C14H18ClFN2/c1-2-3-8-18-9-4-5-14(18)17-11-6-7-13(16)12(15)10-11/h6-7,10H,2-5,8-9H2,1H3
charge 0 multiplicity 1
36 atoms
Cl 3.92787 -1.658767 1.852618
F  5.282941 -0.73384 -0.708261
N  -2.322189 1.097184 0.245954
N  -0.233802 0.475853 -0.639429
C  -2.950935 1.65805 1.461179
C  -1.741222 2.211756 2.260877
C  -0.557182 1.320102 1.800862
C  -0.957134 0.899738 0.376931
C  -3.055017 0.789732 -0.993085
C  -3.429624 -0.703435 -1.158903
C  -4.391073 -1.247031 -0.078402
C  -4.810381 -2.709144 -0.344523
C  1.142536 0.194405 -0.576124
C  1.773351 -0.482615 0.51451
C  1.939388 0.524044 -1.714017
C  3.144742 -0.787608 0.46284
C  3.313548 0.224685 -1.752581
C  3.912742 -0.429075 -0.659844
H  -3.49597 0.876155 2.029606
H  -3.678268 2.445574 1.189916
H  -1.908451 2.174811 3.349775
H  -1.553672 3.261893 1.975894
H  -0.465608 0.426021 2.44675
H  0.418091 1.833983 1.810464
H  -3.968445 1.415839 -1.009596
H  -2.405541 1.088769 -1.837162
H  -2.497101 -1.299064 -1.173012
H  -3.8974 -0.822866 -2.158235
H  -5.294781 -0.60398 -0.030429
H  -3.903593 -1.181916 0.914973
H  -3.926043 -3.372571 -0.381583
H  -5.485918 -3.088288 0.444125
H  -5.336501 -2.799766 -1.313545
H  1.190273 -0.802354 1.382236
H  1.451697 1.017075 -2.559391
H  3.930674 0.483551 -2.618191
