program: Gaussian 09
title: 000213773
version: EM64L-G09RevD.01
frameworkgroup: C1[X(C11H12BrClN2)]
method: RPBEPBE
basis: SDD
operation: Freq
keyword: #p
keyword: freq=noraman
keyword: PBEPBE/SDD
title: #p freq=noraman PBEPBE/SDD
converged: YES YES NO NO
title: Mulliken charges:
elementType: Br Cl N N C C C C C C C C C C C H H H H H H H H H H H H
charge: -0.020380 -0.065968 -0.133835 -0.054713 -0.444759 -0.364240 -0.506219 0.129235 -0.621307 0.373414 -0.360294 -0.352813 -0.186355 -0.209585 -0.123372 0.232196 0.232886 0.229251 0.223730 0.250626 0.255833 0.247628 0.264652 0.222618 0.256752 0.270968 0.254050
chargesum: 0.00000
title: Mulliken charges with hydrogens summed into heavy atoms:
elementType: Br Cl N N C C C C C C C C C C C
charge: -0.020380 -0.065968 -0.133835 -0.054713 0.020323 0.088741 0.000239 0.129235 0.113591 0.373414 -0.360294 -0.096061 0.084613 0.044465 -0.123372
polarizability: 2.39112817e+02 -1.27411496e+01 1.42659563e+02 5.80630135e+00 9.13204501e+00 1.05287652e+02
1716.lowfreq: -7.1328 0.0008 0.0015 0.0016 5.5653 7.6918 30.0598 37.8647 63.3844
frequency: 29.8838 37.8251 63.3745 111.3474 120.5118 135.8125 151.6730 154.4985 158.7156 216.5526 235.6074 261.3807 302.7462 315.8222 348.8460 430.1020 440.1312 470.8624 522.4322 554.2337 592.4066 616.0362 646.6704 660.0051 701.0761 717.0475 811.7607 834.1188 851.5332 863.1978 888.6252 933.7417 939.4414 973.7896 1005.9148 1049.6619 1070.3606 1077.7109 1107.3632 1117.9743 1126.6339 1163.0159 1190.9576 1216.0571 1227.5233 1238.4534 1264.0621 1291.1478 1300.7351 1319.4238 1321.8233 1381.6040 1397.1540 1442.2772 1447.9662 1458.1706 1472.1369 1474.8921 1485.4099 1503.9233 1538.9865 1581.6317 1697.6066 2951.9742 2969.8570 3012.4060 3018.8150 3034.3680 3049.3256 3087.6630 3101.1884 3114.3201 3151.9934 3174.1421 3177.5088
redmass: 5.7828 5.4961 3.9015 2.4321 4.3417 1.7084 9.0575 1.9742 2.8275 2.7773 8.5244 4.7353 5.2120 8.2706 3.6439 3.7357 5.3981 4.2433 4.3339 3.5282 4.4264 4.5490 5.4000 4.0974 4.1264 4.2788 1.4896 3.8988 2.0115 1.3779 1.5283 2.3677 1.3373 2.3154 4.3620 2.3086 1.6072 2.3372 2.0219 1.3252 1.4245 1.3186 1.7824 1.3170 1.6681 1.7166 1.9829 1.8740 1.5395 3.1579 1.7876 4.6553 2.3669 1.9971 1.4228 1.1294 1.0484 1.0883 1.0759 1.1576 8.1627 7.2275 10.3509 1.0651 1.0402 1.0661 1.0742 1.0859 1.0978 1.0994 1.1017 1.0972 1.0881 1.0961 1.0941
irintensity: 0.9450 0.9962 0.5143 0.4496 0.9816 0.2629 0.1808 0.3309 0.7865 8.8706 0.1285 3.1829 2.1375 4.3742 3.5061 7.2222 3.3021 3.7681 15.2391 15.6835 4.7057 28.7308 1.6919 33.2578 12.6725 15.4126 45.3608 4.4999 8.4005 19.8014 8.5594 3.6557 0.3565 83.5201 33.5681 16.0659 0.5862 31.2478 18.1399 4.1969 0.4700 4.0658 20.0164 18.7403 1.5945 35.4116 2.2636 78.6842 2.3325 15.0157 5.3246 6.0418 33.6186 72.7104 124.5893 4.9541 15.6734 16.5854 10.6101 28.7141 6.7614 20.8449 926.4825 66.6687 56.2765 15.5463 15.9705 61.7561 28.1915 16.1599 27.2930 10.6264 3.6793 3.6868 1.5665
temp: 298.150 k
press: 1.00000 atm
elementType: 35 17 7 7 6 6 6 6 6 6 6 6 6 6 6 1 1 1 1 1 1 1 1 1 1 1 1
symmnumber: 1
zpe: 543738.3 jmol-1
zpe.correction: 0.207099 hartree
zpe.thermalcorrener: 0.222003 hartree
zpe.thermalcorrenthalpy: 0.222947 hartree
zpe.thermalcorrgfe: 0.162940 hartree
zpe.sumelectzpe: -1008.283594 hartree
zpe.sumelectthermal: -1008.268690 hartree
zpe.sumelectthermalent: -1008.267746 hartree
zpe.sumelectthermalfe: -1008.327753 hartree
dipole: -5.2753 -1.5367 2.3383
dipole: 5.9714
quadrupole: -97.7838 -100.7999 -105.3250
quadrupole: 1.5117 -3.6700 0.2326
quadrupole: 3.5191 0.5030 -4.0221 1.5117 -3.6700 0.2326
hfenergy: -1008.4906935 hartree
pointgroup: C01 [X(C11H12Br1Cl1N2)]
dipole: 2.0340053 -1.0675828 -0.4923411 debye
polarizability: 238.5764693|10.7074588|119.6538287|-10.4646161|-21.0936242|128.8297344 unknown
InChI: InChI=1S/C11H12BrClN2/c1-15-6-2-3-11(15)14-10-5-4-8(13)7-9(10)12/h4-5,7H,2-3,6H2,1H3
charge 0 multiplicity 1
27 atoms
Br -0.265207 2.065627 -1.54005
Cl -5.214873 -0.281907 -0.053447
N  2.040234 -0.850164 -0.723374
N  0.734536 0.333441 0.989725
C  4.230517 -0.316039 0.045628
C  3.448924 -0.84608 -1.18479
C  3.188255 0.555677 0.7898
C  1.831048 -0.003126 0.35944
C  1.015596 -1.553999 -1.499304
C  -0.60697 0.132556 0.658233
C  -1.285924 0.847862 -0.378852
C  -1.424234 -0.705089 1.481465
C  -2.672416 0.735298 -0.602721
C  -2.809785 -0.843426 1.274779
C  -3.418151 -0.121551 0.228894
H  5.131169 0.247204 -0.247815
H  4.546341 -1.161832 0.681098
H  3.569292 -0.182084 -2.066894
H  3.756628 -1.865632 -1.482525
H  3.237467 1.616246 0.479229
H  3.28312 0.530798 1.886325
H  0.693335 -0.972695 -2.38586
H  0.130508 -1.749163 -0.875526
H  1.418518 -2.524263 -1.842403
H  -0.933866 -1.239995 2.300639
H  -3.156099 1.301895 -1.402167
H  -3.405167 -1.495961 1.919676
