program: Gaussian 09
title: 000213775
version: EM64L-G09RevD.01
frameworkgroup: C1[X(C14H18BrClN2)]
method: RPBEPBE
basis: SDD
operation: Freq
keyword: #p
keyword: freq=noraman
keyword: PBEPBE/SDD
title: #p freq=noraman PBEPBE/SDD
converged: YES YES NO NO
title: Mulliken charges:
elementType: Br Cl N N C C C C C C C C C C C C C C H H H H H H H H H H H H H H H H H H
charge: -0.025453 -0.065972 -0.152653 -0.089527 -0.358799 -0.460385 -0.496851 0.145602 -0.395694 -0.347480 -0.337675 -0.691541 0.391776 -0.366462 -0.352289 -0.179026 -0.206867 -0.117107 0.221994 0.225735 0.231319 0.234097 0.256410 0.254735 0.194379 0.239343 0.246593 0.189343 0.183989 0.204425 0.222604 0.213678 0.208149 0.255014 0.270519 0.254076
chargesum: 0.00000
title: Mulliken charges with hydrogens summed into heavy atoms:
elementType: Br Cl N N C C C C C C C C C C C C C C
charge: -0.025453 -0.065972 -0.152653 -0.089527 0.088930 0.005031 0.014293 0.145602 0.038028 0.088456 0.050740 -0.047110 0.391776 -0.366462 -0.097276 0.091493 0.047209 -0.117107
polarizability: 2.85350599e+02 -3.24509603e-01 1.68708046e+02 1.14226732e+01 1.65491802e+01 1.38395270e+02
1716.lowfreq: -11.2022 -8.3150 -4.3055 -0.0028 -0.0023 -0.0022 11.8273 19.7175 43.6227
frequency: 10.9365 19.3465 43.6102 45.6971 65.9161 81.4297 111.6661 124.9118 132.0713 143.2247 151.3373 168.2554 190.6805 230.7662 238.8448 257.6212 301.6379 316.5529 317.3985 364.3090 429.7501 463.3348 480.9321 496.3268 514.6634 543.0313 593.7742 608.9416 645.0313 671.7291 704.6699 723.2606 749.1021 810.5388 815.9528 830.7045 853.5530 863.1198 876.7214 896.1094 921.9104 940.4132 942.2585 980.4997 1003.3094 1021.8456 1042.0614 1065.5210 1076.8910 1078.6821 1114.7868 1125.7088 1132.2020 1160.0327 1180.9228 1199.0905 1217.3367 1232.0197 1237.3763 1246.5901 1282.3429 1284.2771 1288.0346 1303.6281 1314.4985 1322.7070 1331.7919 1345.8356 1366.5505 1378.3840 1390.7628 1420.0363 1445.0719 1454.5971 1462.4862 1472.1847 1473.2010 1477.1042 1477.7082 1486.3450 1506.4678 1542.3578 1583.4346 1662.2676 2958.1428 2963.3916 2973.3613 2974.8238 2988.3313 3005.6390 3009.7853 3017.5402 3032.9208 3042.3228 3055.9168 3071.4319 3073.0927 3076.2491 3095.4473 3151.1846 3173.8595 3178.2777
redmass: 4.2790 6.7578 5.0494 6.3610 1.8521 2.6777 3.9646 2.5569 4.9818 3.9427 6.0258 2.5303 3.5092 1.1959 6.7757 2.4289 5.2656 7.6766 4.6128 3.3799 3.2921 3.6365 3.7391 4.7729 4.0819 3.6975 3.6114 3.0201 6.4847 3.6751 4.8845 2.9334 1.2166 2.0435 1.5410 3.0890 1.8028 1.3862 1.5909 1.6670 1.7631 1.8667 1.3597 2.2549 3.5753 2.3182 2.8060 2.3605 1.7462 2.3056 2.2115 1.3989 1.6728 1.3488 2.6338 1.4592 1.2460 1.4935 1.4051 1.8360 1.3280 1.3804 1.4554 1.4766 1.3194 3.6590 1.6651 1.4434 1.3625 4.7786 1.2126 2.2907 1.3446 1.1157 1.0764 1.1563 1.2867 1.0808 1.3354 1.0741 1.2136 8.2909 7.3192 9.8392 1.0615 1.0630 1.0419 1.0575 1.0600 1.0640 1.0961 1.0748 1.0871 1.1014 1.1030 1.1008 1.0995 1.0983 1.1044 1.0882 1.0965 1.0937
irintensity: 0.0738 0.1045 0.6220 1.0679 0.4957 0.6976 0.3505 0.0165 1.3161 0.4647 0.2949 1.8391 4.8470 0.2067 0.2478 1.1676 3.3583 3.3740 0.0205 0.7989 11.5398 0.9169 6.6713 8.7902 12.5279 5.5011 11.7958 2.4683 2.1567 46.5026 26.7185 3.2406 12.2436 4.5462 40.6564 4.1441 9.4441 19.7472 2.3463 9.2559 15.4049 10.4635 1.2396 3.7965 29.1224 20.2400 3.7383 4.8318 2.2854 30.8923 4.9953 1.2388 5.7938 3.5332 83.2471 1.7168 2.4193 1.2594 9.0113 116.9631 6.0571 25.1246 65.1888 39.2839 3.5720 18.2261 25.6944 23.9412 9.5079 15.7438 10.7909 179.3868 31.8235 11.2291 2.5366 13.4818 8.0587 11.4917 9.2577 14.1269 8.9132 8.2270 23.1541 1027.2955 22.6111 88.0159 18.5383 56.8325 54.5035 9.5124 13.3781 15.6989 55.5656 15.9926 28.1541 93.7619 52.5167 8.0650 31.4560 4.3029 4.1811 1.0729
temp: 298.150 k
press: 1.00000 atm
elementType: 35 17 7 7 6 6 6 6 6 6 6 6 6 6 6 6 6 6 1 1 1 1 1 1 1 1 1 1 1 1 1 1 1 1 1 1
symmnumber: 1
zpe: 763939.5 jmol-1
zpe.correction: 0.290969 hartree
zpe.thermalcorrener: 0.309982 hartree
zpe.thermalcorrenthalpy: 0.310926 hartree
zpe.thermalcorrgfe: 0.239612 hartree
zpe.sumelectzpe: -1125.959710 hartree
zpe.sumelectthermal: -1125.940697 hartree
zpe.sumelectthermalent: -1125.939753 hartree
zpe.sumelectthermalfe: -1126.011067 hartree
dipole: 4.9369 -2.9788 1.2752
dipole: 5.9053
quadrupole: -124.4386 -118.0996 -122.0526
quadrupole: -2.8710 1.6315 0.0861
quadrupole: -2.9083 3.4306 -0.5223 -2.8710 1.6315 0.0861
hfenergy: -1126.2506787 hartree
pointgroup: C01[X(C14H18Br1Cl1N2)]
dipole: -1.7661749 1.4521343 0.4119712 debye
polarizability: 281.5422185|-17.0649599|165.4142088|-20.3119205|-17.9521863|145.4974874 unknown
InChI: InChI=1S/C14H18BrClN2/c1-2-3-8-18-9-4-5-14(18)17-13-7-6-11(16)10-12(13)15/h6-7,10H,2-5,8-9H2,1H3
charge 0 multiplicity 1
36 atoms
Br 0.438678 -2.073904 1.37556
Cl 5.786517 -1.176561 -0.284079
N  -2.136505 1.289403 -0.043608
N  -0.080034 0.349289 -0.710557
C  -2.751605 2.058769 1.059996
C  -1.525863 2.64018 1.81803
C  -0.378352 1.644504 1.498192
C  -0.797611 1.021292 0.162538
C  -2.881173 0.772955 -1.204453
C  -3.286607 -0.717242 -1.090202
C  -4.259873 -1.036272 0.066269
C  -4.68934 -2.51948 0.079323
C  1.270306 0.020958 -0.528773
C  1.731289 -1.040703 0.309572
C  2.268749 0.687587 -1.304866
C  3.088044 -1.414296 0.392113
C  3.631899 0.34099 -1.239113
C  4.024917 -0.707548 -0.384578
H  -3.362335 1.402567 1.713584
H  -3.415098 2.847193 0.658658
H  -1.717459 2.738841 2.898914
H  -1.279579 3.64041 1.420504
H  -0.302613 0.844289 2.258565
H  0.61199 2.123378 1.42323
H  -3.778649 1.40742 -1.339322
H  -2.231494 0.895025 -2.091727
H  -2.366118 -1.322077 -0.985699
H  -3.753784 -1.011857 -2.052861
H  -5.15885 -0.389493 -0.01378
H  -3.776207 -0.790645 1.03265
H  -3.810394 -3.181796 0.191018
H  -5.383787 -2.733988 0.91233
H  -5.197154 -2.79373 -0.864656
H  1.935957 1.486577 -1.97472
H  3.403065 -2.234547 1.041685
H  4.371871 0.873515 -1.843236
