program: Gaussian 09
title: 000213770
version: EM64L-G09RevD.01
frameworkgroup: C1[X(C13H16Cl2N2)]
method: RPBEPBE
basis: SDD
operation: Freq
keyword: #p
keyword: freq=noraman
keyword: PBEPBE/SDD
title: #p freq=noraman PBEPBE/SDD
converged: YES YES NO NO
title: Mulliken charges:
elementType: Cl Cl N N C C C C C C C C C C C C C H H H H H H H H H H H H H H H H
charge: -0.068470 -0.065977 -0.180550 -0.109108 -0.378996 -0.458316 -0.509872 -0.032490 0.192171 -0.686787 -0.689395 0.399245 -0.279860 -0.356258 -0.221827 -0.212705 -0.106149 0.226700 0.222782 0.232892 0.231516 0.254361 0.254012 0.192936 0.207245 0.266308 0.208999 0.211063 0.208271 0.265340 0.253376 0.275649 0.253895
chargesum: 0.00000
title: Mulliken charges with hydrogens summed into heavy atoms:
elementType: Cl Cl N N C C C C C C C C C C C C C
charge: -0.068470 -0.065977 -0.180550 -0.109108 0.070487 0.006092 -0.001500 0.160446 0.192171 -0.004235 -0.004721 0.399245 -0.279860 -0.102883 0.053822 0.041190 -0.106149
polarizability: 2.66944977e+02 8.16316424e+00 1.46195636e+02 -5.82403091e+00 -1.44535762e+01 1.27530055e+02
1716.lowfreq: -8.3689 -6.1226 0.0017 0.0028 0.0030 7.7957 28.1080 39.0014 49.5631
frequency: 28.0297 38.9355 49.5333 61.2788 108.4108 116.4606 130.4400 149.6147 164.7022 175.1413 186.8948 206.3606 236.1208 272.9127 292.1745 318.6658 322.2489 367.6638 403.1447 429.4815 441.1925 472.5230 504.9891 531.0267 547.6394 591.5261 612.8961 647.6994 671.4241 710.7613 723.2118 814.8201 829.3580 849.8855 859.6792 874.7299 895.7793 918.7047 937.5480 942.1816 942.4209 973.8852 1021.4658 1037.8308 1073.2815 1077.0233 1128.9899 1133.5200 1138.7885 1143.2830 1162.3227 1184.6533 1211.4909 1221.0487 1233.4267 1248.1165 1284.2179 1303.2097 1311.6326 1316.0798 1326.1354 1349.0061 1370.8161 1383.4984 1389.5437 1427.6563 1454.0087 1455.2959 1466.2441 1473.0063 1477.8326 1479.5044 1497.2424 1500.9720 1545.0607 1587.8808 1657.4800 2947.9288 2985.2106 2986.2140 2993.8665 3007.1147 3017.3476 3034.3925 3077.0191 3077.2704 3082.4045 3095.2695 3105.5123 3110.8964 3152.5906 3174.5679 3178.0111
redmass: 5.9490 5.4516 3.9998 3.3167 3.2662 3.2998 3.0569 5.4071 6.4712 1.8771 11.5427 1.0652 1.0963 8.4354 3.0634 4.5374 4.7390 10.3333 3.1537 3.3996 3.4654 4.4452 5.5643 4.0053 3.4952 3.6660 3.1851 5.2807 3.4379 4.8542 4.0399 1.5105 3.9684 1.9671 1.3753 2.5976 1.6098 1.1799 2.3399 1.4664 1.3434 2.6976 3.6517 2.1138 1.6687 2.3707 1.4203 2.0130 2.3277 2.2239 1.3966 1.9976 1.5952 1.3405 1.4920 2.3060 1.5934 1.6173 1.3775 1.3848 3.9103 1.5896 1.2114 3.2493 1.3730 2.1927 1.2347 1.0460 1.2438 1.1099 1.3746 1.1013 1.0586 1.2610 8.4322 7.3948 9.4552 1.0669 1.0378 1.0489 1.0691 1.0632 1.0710 1.0882 1.0993 1.0996 1.0995 1.1043 1.1002 1.0995 1.0882 1.0962 1.0941
irintensity: 0.6392 0.5615 0.4524 1.6448 0.4435 0.4572 0.0964 3.6836 0.0457 3.9807 0.6520 0.0589 0.4175 1.1177 0.7646 0.5185 0.1099 4.3806 8.1898 9.3247 8.4942 1.7377 8.8652 7.2973 5.1404 11.7258 5.4651 9.7231 24.5042 38.8344 13.5413 40.3334 6.1016 13.1586 23.6266 0.9064 6.0615 3.8659 4.7853 0.0769 0.3350 10.5004 46.0048 4.5775 9.1982 31.7685 1.2746 27.9842 9.8395 33.9832 1.7090 48.8077 14.0054 13.3274 3.2296 172.9504 84.8893 49.4786 2.8802 0.6488 15.2231 85.7183 28.2369 10.6125 18.4901 139.6988 8.5063 0.9306 7.6622 17.8011 24.7516 6.5819 7.4712 16.7230 7.8196 22.3775 999.8444 80.1694 33.6600 17.0390 58.1521 8.9871 16.5111 61.2531 12.6292 13.7196 58.0306 32.0428 1.7014 33.8546 4.4633 3.3561 1.5728
temp: 298.150 k
press: 1.00000 atm
elementType: 17 17 7 7 6 6 6 6 6 6 6 6 6 6 6 6 6 1 1 1 1 1 1 1 1 1 1 1 1 1 1 1 1
symmnumber: 1
zpe: 690540.0 jmol-1
zpe.correction: 0.263013 hartree
zpe.thermalcorrener: 0.280429 hartree
zpe.thermalcorrenthalpy: 0.281374 hartree
zpe.thermalcorrgfe: 0.216294 hartree
zpe.sumelectzpe: -1533.338541 hartree
zpe.sumelectthermal: -1533.321125 hartree
zpe.sumelectthermalent: -1533.320180 hartree
zpe.sumelectthermalfe: -1533.385260 hartree
dipole: -5.2237 -0.6635 -2.1784
dipole: 5.6984
quadrupole: -111.8698 -111.7781 -113.5750
quadrupole: 2.7012 2.0787 -0.0048
quadrupole: 0.5378 0.6295 -1.1673 2.7012 2.0787 -0.0048
hfenergy: -1533.6015541 hartree
pointgroup: C01 [X(C13H16Cl2N2)]
dipole: -1.9782471 -1.0544529 0.0311442 debye
polarizability: 265.6080888|8.9435317|120.9960994|-14.0493222|4.2831693|154.0664803 unknown
InChI: InChI=1S/C13H16Cl2N2/c1-9(2)17-7-3-4-13(17)16-12-6-5-10(14)8-11(12)15/h5-6,8-9H,3-4,7H2,1-2H3
charge 0 multiplicity 1
33 atoms
Cl 0.802408 1.006284 2.321394
Cl 5.626815 0.343247 -0.341864
N  -2.634688 -0.466071 0.092371
N  -0.449557 0.266516 -0.471972
C  -3.316731 -1.531577 0.863987
C  -2.231031 -2.629977 1.004201
C  -0.899287 -1.839112 0.931642
C  -3.392309 0.701911 -0.436822
C  -1.258158 -0.584024 0.125093
C  -3.199402 0.855442 -1.963759
C  -3.04392 2.000986 0.329721
C  0.948172 0.21239 -0.382555
C  1.693321 0.558493 0.785366
C  1.719539 -0.075725 -1.550611
C  3.099702 0.605838 0.817089
C  3.127639 -0.045732 -1.551798
C  3.80175 0.292834 -0.36164
H  -4.212797 -1.887554 0.323459
H  -3.644777 -1.151105 1.854833
H  -2.300297 -3.334793 0.156981
H  -2.338998 -3.204458 1.938621
H  -0.077126 -2.399305 0.456495
H  -0.552401 -1.525677 1.934372
H  -4.45758 0.462827 -0.245961
H  -3.82279 1.687689 -2.338633
H  -2.142732 1.070268 -2.190009
H  -3.495252 -0.068396 -2.493005
H  -3.219105 1.882216 1.414514
H  -3.675073 2.832055 -0.034358
H  -1.985538 2.264738 0.172739
H  1.17351 -0.31734 -2.467759
H  3.627096 0.880464 1.734099
H  3.688592 -0.276947 -2.461731
