program: Gaussian 09
title: 000213769
version: EM64L-G09RevD.01
frameworkgroup: C1[X(C14H18Cl2N2)]
method: RPBEPBE
basis: SDD
operation: Freq
keyword: #p
keyword: freq=noraman
keyword: PBEPBE/SDD
title: #p freq=noraman PBEPBE/SDD
converged: YES YES NO NO
title: Mulliken charges:
elementType: Cl Cl N N C C C C C C C C C C C C C C H H H H H H H H H H H H H H H H H H
charge: -0.071271 -0.066305 -0.157573 -0.087695 -0.356427 -0.464255 -0.372068 -0.504874 0.151770 -0.042379 -0.703342 -0.702940 0.395082 -0.277183 -0.357191 -0.221677 -0.212674 -0.106355 0.222909 0.225180 0.231561 0.233703 0.231865 0.193508 0.254142 0.254695 0.252254 0.194492 0.220792 0.220981 0.198930 0.218839 0.219582 0.254121 0.275769 0.254034
chargesum: 0.00000
title: Mulliken charges with hydrogens summed into heavy atoms:
elementType: Cl Cl N N C C C C C C C C C C C C C C
charge: -0.071271 -0.066305 -0.157573 -0.087695 0.091662 0.001009 0.053305 0.003963 0.151770 0.209875 -0.067077 -0.065589 0.395082 -0.277183 -0.103070 0.054092 0.041361 -0.106355
polarizability: 2.81386777e+02 -1.14501392e+01 1.35293322e+02 -7.75106341e+00 1.18797423e-01 1.59322768e+02
1716.lowfreq: -14.8526 -0.0021 -0.0005 0.0009 4.6909 6.0016 25.0640 28.8971 39.5436
frequency: 24.2490 28.7736 39.4797 58.3814 65.2124 92.9155 130.5505 135.8472 164.1732 164.2854 170.9210 197.5332 201.0507 246.9652 259.2576 277.3350 303.6276 320.4384 359.4488 371.1701 403.3237 403.9623 433.4355 487.0443 500.0061 519.7324 545.6841 608.1983 624.1185 655.4529 697.7826 709.7294 738.8730 808.5789 814.5708 832.4382 858.0631 864.1007 872.5365 897.2087 919.8609 935.4789 936.5962 942.4741 960.8544 1007.3482 1026.9889 1049.3778 1076.1028 1077.4154 1126.0877 1128.7833 1136.9761 1161.2043 1177.8908 1186.8643 1205.5515 1218.8039 1232.2815 1250.9945 1284.8330 1288.8876 1308.2590 1311.9797 1324.0361 1326.9830 1344.7581 1359.4998 1377.5301 1384.2355 1395.6816 1421.1473 1443.4346 1456.6593 1466.2975 1471.4364 1474.9409 1478.4672 1482.2713 1487.7607 1506.4298 1545.1910 1588.6048 1659.8199 2962.2588 2965.9298 2968.5166 2978.9609 3005.4969 3009.1514 3016.4018 3031.6041 3043.8852 3056.5971 3067.6777 3073.2557 3076.8199 3076.9614 3095.1813 3153.5394 3175.1865 3178.6288
redmass: 7.0045 3.9124 3.1515 4.2971 5.4348 3.1325 3.2259 3.1828 2.4139 4.6436 5.2533 1.0812 3.7875 1.3267 3.7185 3.7586 4.0064 4.5645 5.5229 6.2942 1.9670 2.5213 3.2380 4.8819 5.8557 3.6964 3.7621 5.3405 2.7190 6.5206 4.6476 5.8088 3.1859 2.7016 1.5146 2.9456 1.3823 2.2582 1.5546 1.5881 1.2351 2.2400 1.9042 1.3414 1.4696 3.1862 2.3340 3.1781 1.8878 2.1263 2.0683 1.3953 2.0719 1.3376 1.8480 2.1578 1.6021 1.3283 1.4443 1.9842 1.7960 1.3983 1.4596 1.2452 1.8315 3.0459 1.4256 1.3691 1.2336 4.8549 1.2240 2.1968 1.3085 1.1767 1.0614 1.1693 1.1321 1.4668 1.0725 1.0650 1.2374 8.4381 7.4252 9.8615 1.0602 1.0392 1.0384 1.0587 1.0831 1.0631 1.0766 1.0863 1.1037 1.0983 1.0981 1.0994 1.0988 1.0988 1.1043 1.0882 1.0963 1.0941
irintensity: 0.2199 0.1154 0.1023 0.8656 1.9543 0.8863 0.6250 1.1548 1.4815 0.2948 0.7179 0.0802 2.3910 1.2944 2.7078 1.0649 1.3713 0.2121 2.3211 3.1377 2.0244 2.3571 8.2413 0.6983 18.7786 8.1060 5.9409 10.2544 24.4404 0.7911 12.7643 44.1426 3.8815 8.4195 38.7422 3.9640 23.1972 7.3484 17.0033 3.4447 5.9998 4.1763 7.0236 0.2701 1.1492 24.4120 23.3148 9.7402 20.1305 15.6303 23.8393 0.5864 2.2758 1.5680 21.9783 57.6515 10.1787 8.1577 1.3279 112.9789 121.7022 2.6467 16.6475 0.2292 12.4576 15.3160 22.4986 5.9355 24.4934 16.5468 28.9490 154.5618 41.2898 9.2408 5.5691 7.3509 10.3604 12.9387 7.5462 15.7841 13.2125 7.2706 19.7307 1066.2337 45.5566 58.4698 38.7066 56.6021 2.8267 8.2958 13.6594 58.2148 10.5834 10.6909 81.8759 30.0220 65.8381 7.7481 31.5738 4.0605 3.3575 1.6581
temp: 298.150 k
press: 1.00000 atm
elementType: 17 17 7 7 6 6 6 6 6 6 6 6 6 6 6 6 6 6 1 1 1 1 1 1 1 1 1 1 1 1 1 1 1 1 1 1
symmnumber: 1
zpe: 764231.8 jmol-1
zpe.correction: 0.291081 hartree
zpe.thermalcorrener: 0.309846 hartree
zpe.thermalcorrenthalpy: 0.310790 hartree
zpe.thermalcorrgfe: 0.242007 hartree
zpe.sumelectzpe: -1572.562796 hartree
zpe.sumelectthermal: -1572.544031 hartree
zpe.sumelectthermalent: -1572.543087 hartree
zpe.sumelectthermalfe: -1572.611870 hartree
dipole: -4.8262 2.6789 -0.8481
dipole: 5.5846
quadrupole: -123.0054 -117.4567 -118.6081
quadrupole: -3.3732 -0.4224 -0.2627
quadrupole: -3.3153 2.2334 1.0820 -3.3732 -0.4224 -0.2627
hfenergy: -1572.8538764 hartree
pointgroup: C01 [X(C14H18Cl2N2)]
dipole: -1.7700964 -1.3014643 0.0221988 debye
polarizability: 276.1245961|25.4169972|140.0797604|16.5013504|-2.19213|159.7985113 unknown
InChI: InChI=1S/C14H18Cl2N2/c1-10(2)9-18-7-3-4-14(18)17-13-6-5-11(15)8-12(13)16/h5-6,8,10H,3-4,7,9H2,1-2H3
charge 0 multiplicity 1
36 atoms
Cl 0.858511 0.945248 -2.15089
Cl 5.809188 1.033087 0.355257
N  -2.228877 -1.048141 0.165372
N  -0.167094 -0.028717 0.670038
C  -2.805415 -2.193871 -0.572147
C  -1.574099 -3.10318 -0.840442
C  -3.026194 -0.050825 0.895822
C  -0.371157 -2.121564 -0.827104
C  -0.855387 -0.964867 0.052515
C  -3.200855 1.305192 0.156373
C  -3.912743 1.139437 -1.20451
C  -3.965478 2.286843 1.073709
C  1.215193 0.15203 0.536154
C  1.857299 0.626223 -0.648213
C  2.060486 -0.017377 1.676259
C  3.23614 0.899716 -0.722499
C  3.444707 0.238573 1.634702
C  4.017033 0.691698 0.429501
H  -3.283362 -1.861517 -1.516398
H  -3.578303 -2.696654 0.038467
H  -1.666093 -3.654159 -1.790564
H  -1.469131 -3.84063 -0.025241
H  -2.519286 0.140829 1.861407
H  -4.01995 -0.494365 1.104173
H  -0.144408 -1.733041 -1.837484
H  0.55544 -2.566545 -0.428184
H  -2.18399 1.70624 -0.020587
H  -4.92461 0.705963 -1.075868
H  -4.02796 2.118196 -1.705454
H  -3.337728 0.485085 -1.884613
H  -4.98625 1.915486 1.292556
H  -4.065307 3.276367 0.591858
H  -3.440135 2.431692 2.036162
H  1.589781 -0.352616 2.605536
H  3.682048 1.265421 -1.650786
H  4.064785 0.091747 2.52342
