program: Gaussian 09
title: 000213765
version: EM64L-G09RevD.01
frameworkgroup: C1[X(C11H11Cl3N2)]
method: RPBEPBE
basis: SDD
operation: Freq
keyword: #p
keyword: freq=noraman
keyword: PBEPBE/SDD
title: #p freq=noraman PBEPBE/SDD
converged: YES YES NO NO
title: Mulliken charges:
elementType: Cl Cl Cl N N C C C C C C C C C C C H H H H H H H H H H H
charge: -0.053096 -0.020941 -0.014252 -0.151947 -0.107160 -0.448338 -0.366775 -0.503406 0.185100 -0.638344 0.437139 -0.326908 -0.361058 -0.055367 -0.200405 -0.107068 0.241685 0.232167 0.229092 0.224828 0.268531 0.244691 0.228830 0.283031 0.222740 0.278562 0.278671
chargesum: 0.00000
title: Mulliken charges with hydrogens summed into heavy atoms:
elementType: Cl Cl Cl N N C C C C C C C C C C C
charge: -0.053096 -0.020941 -0.014252 -0.151947 -0.107160 0.025513 0.087145 0.009816 0.185100 0.096257 0.437139 -0.326908 -0.082496 -0.055367 0.078266 -0.107068
polarizability: 2.68048037e+02 1.69517866e+00 1.50906961e+02 -1.04036905e+01 1.50027036e+00 9.60663985e+01
1716.lowfreq: -9.3703 -2.4396 -0.0018 -0.0016 -0.0006 2.2617 31.1916 43.4991 47.9400
frequency: 31.1347 43.4616 47.9343 84.7006 104.8034 135.0604 146.4081 151.1805 173.0485 177.1842 207.8481 213.9492 225.7566 288.0931 307.7673 339.8428 366.9425 433.9192 457.9798 491.3282 522.3955 562.8387 574.4996 595.9756 620.4538 656.7167 676.5432 711.0516 746.1589 845.6730 847.1491 868.9852 879.2618 905.8509 932.1261 982.0171 1026.0389 1047.0371 1070.4657 1109.9583 1112.1935 1122.8673 1169.5715 1193.3938 1217.2018 1226.3740 1231.9398 1268.5534 1287.4785 1290.7245 1314.4698 1323.5500 1364.9699 1412.4739 1424.4114 1448.6820 1460.6108 1474.7602 1479.8598 1486.8162 1514.7872 1526.5401 1582.6477 1669.3763 2949.3499 2963.7406 3005.9186 3021.7916 3035.5358 3039.3629 3087.7910 3101.4377 3105.2713 3176.0700 3178.2011
redmass: 4.7999 7.5788 4.7449 6.4331 1.1741 2.2850 6.8966 2.0461 7.9704 27.4248 3.0118 4.3294 6.2567 10.4370 21.2006 10.8346 4.7042 3.3229 6.2445 5.8879 3.0586 7.0702 7.2342 4.0798 4.6688 6.7160 3.5495 4.8116 3.8221 1.5415 1.9186 1.4625 2.0323 2.5117 2.4853 2.5620 3.9525 2.4848 1.6299 1.7692 2.1494 1.3194 1.3250 2.1209 1.3221 1.2257 2.0253 3.0616 1.6977 2.1938 1.9745 1.8353 7.7398 1.6296 1.7637 1.3421 1.3779 1.0927 1.0568 1.1982 1.4532 9.4795 8.4522 9.3881 1.0656 1.0374 1.0664 1.0786 1.0797 1.1002 1.0975 1.1035 1.0979 1.0920 1.0931
irintensity: 0.9435 0.5117 1.0317 0.5246 0.3599 0.1400 0.5549 0.7766 1.3817 0.2399 6.7850 1.7908 2.3674 0.7808 1.1599 0.0826 1.3470 13.9798 6.8204 4.3144 2.8169 9.5319 61.3251 4.6904 0.7386 16.4533 1.1216 14.0473 4.4362 5.1074 15.6210 40.3246 7.2484 9.0866 14.6849 44.3150 72.1108 16.7942 7.2086 0.8455 129.9766 2.9299 2.1998 37.1067 6.5258 5.3274 4.4635 25.7721 8.8216 155.9381 25.6861 14.7206 26.7873 105.5687 124.2437 21.9222 17.7974 13.0027 16.9746 2.1026 6.0045 16.2077 85.1176 1195.1729 79.1039 117.9012 13.8170 14.5461 63.8677 27.4426 8.5305 27.8866 1.6718 0.5783 0.2768
temp: 298.150 k
press: 1.00000 atm
elementType: 17 17 17 7 7 6 6 6 6 6 6 6 6 6 6 6 1 1 1 1 1 1 1 1 1 1 1
symmnumber: 1
zpe: 519647.4 jmol-1
zpe.correction: 0.197923 hartree
zpe.thermalcorrener: 0.213997 hartree
zpe.thermalcorrenthalpy: 0.214941 hartree
zpe.thermalcorrgfe: 0.152368 hartree
zpe.sumelectzpe: -1914.274719 hartree
zpe.sumelectthermal: -1914.258645 hartree
zpe.sumelectthermalent: -1914.257701 hartree
zpe.sumelectthermalfe: -1914.320274 hartree
dipole: 6.6200 -0.4652 1.6484
dipole: 6.8379
quadrupole: -103.1262 -113.4682 -113.3022
quadrupole: -6.6466 3.5691 1.2356
quadrupole: 6.8394 -3.5027 -3.3367 -6.6466 3.5691 1.2356
hfenergy: -1914.4726419 hartree
pointgroup: C01 [X(C11H11Cl3N2)]
dipole: -2.5496087 0.2776327 0.8123321 debye
polarizability: 267.4325506|9.6715999|143.1539972|-7.5439254|-20.7046071|104.4348492 unknown
InChI: InChI=1S/C11H11Cl3N2/c1-16-4-2-3-11(16)15-10-6-8(13)7(12)5-9(10)14/h5-6H,2-4H2,1H3
charge 0 multiplicity 1
27 atoms
Cl -0.101226 -2.589406 0.373093
Cl 3.837235 2.296348 -1.048976
Cl 5.036092 -0.567347 0.084907
N  -3.219804 0.331408 -0.243916
N  -0.926434 0.236725 -0.782482
C  -3.25498 0.048302 2.115699
C  -4.128986 0.486512 0.908644
C  -1.798837 0.305431 1.644258
C  -1.887908 0.2590 0.113984
C  -3.687963 0.406129 -1.625779
C  0.427193 0.044625 -0.493682
C  0.991483 -1.176388 -0.010987
C  1.356916 1.08145 -0.808616
C  2.739941 0.913109 -0.633094
C  2.374271 -1.360008 0.160165
C  3.25883 -0.306206 -0.146474
H  -3.400787 -1.028038 2.310595
H  -3.51077 0.601045 3.034078
H  -5.02579 -0.147632 0.78159
H  -4.468538 1.540164 1.001873
H  -1.084335 -0.439137 2.028031
H  -1.435704 1.306344 1.947002
H  -4.427388 -0.390243 -1.833305
H  -2.816191 0.274996 -2.286378
H  -4.156835 1.387142 -1.839436
H  0.962618 2.021108 -1.203459
H  2.765497 -2.312231 0.526867
