program: Gaussian 09
title: 000012341
version: EM64L-G09RevD.01
frameworkgroup: C1[X(C4H9ClO)]
method: RPBEPBE
basis: SDD
operation: Freq
keyword: #p
keyword: freq=noraman
keyword: PBEPBE/SDD
title: #p freq=noraman PBEPBE/SDD
converged: YES YES NO NO
title: Mulliken charges:
elementType: Cl O C C C C H H H H H H H H H
charge: -0.067791 -0.265933 -0.170999 -0.209709 -0.580934 -0.675420 0.191731 0.211022 0.185200 0.193964 0.248363 0.275775 0.202083 0.235064 0.227584
chargesum: 0.00000
title: Mulliken charges with hydrogens summed into heavy atoms:
elementType: Cl O C C C C
charge: -0.067791 -0.265933 0.231753 0.169454 -0.056795 -0.010688
polarizability: 6.55470455e+01 -2.54489958e+00 5.72625237e+01 -6.88568501e-01 2.49407946e+00 4.50874755e+01
1716.lowfreq: -17.9155 -5.4776 0.0036 0.0038 0.0046 9.3618 54.4950 60.4494 135.7356
frequency: 54.4308 60.2943 135.7294 182.6116 230.3911 284.3603 408.2988 459.1548 609.1285 778.5692 817.2821 904.5734 957.6046 1008.2838 1055.2560 1095.5121 1119.9922 1136.3610 1174.9042 1225.0485 1252.8897 1296.6466 1338.6875 1390.2692 1405.2943 1431.2850 1458.8291 1458.8854 1479.7611 1493.1320 2895.8752 2919.1968 2966.8241 2972.1474 2995.8659 3063.3867 3093.5274 3103.4837 3147.2421
redmass: 3.0890 2.3028 4.7681 2.4941 1.1674 2.5745 2.8091 2.9408 5.0346 2.2105 1.0887 2.0206 1.8660 2.0243 2.5377 3.6964 2.0853 1.4062 1.2303 1.1821 1.1486 1.1904 1.2465 1.2419 1.4240 1.1132 1.0486 1.0762 1.0489 1.0788 1.0626 1.0562 1.1047 1.0966 1.0359 1.0574 1.0991 1.1010 1.1102
irintensity: 3.4077 0.5172 5.9855 2.5994 1.3034 1.9988 3.6578 6.5994 26.2554 1.6950 3.8535 10.0326 22.0603 17.1143 67.9592 57.7559 33.8638 6.8876 3.4812 0.9959 0.2017 25.8123 30.0865 17.6517 8.3010 11.6052 11.5407 11.5873 4.0675 6.4343 56.0670 90.8123 82.2536 23.9385 21.3428 25.3256 35.1216 35.6143 12.1073
temp: 298.150 k
press: 1.00000 atm
elementType: 17 8 6 6 6 6 1 1 1 1 1 1 1 1 1
symmnumber: 1
zpe: 328141.7 jmol-1
zpe.correction: 0.124983 hartree
zpe.thermalcorrener: 0.132880 hartree
zpe.thermalcorrenthalpy: 0.133825 hartree
zpe.thermalcorrgfe: 0.091425 hartree
zpe.sumelectzpe: -692.574836 hartree
zpe.sumelectthermal: -692.566938 hartree
zpe.sumelectthermalent: -692.565994 hartree
zpe.sumelectthermalfe: -692.608394 hartree
dipole: -1.7297 2.8163 -0.6443
dipole: 3.3672
quadrupole: -44.0968 -42.2610 -43.8494
quadrupole: 3.4703 2.2969 0.3490
quadrupole: -0.6944 1.1414 -0.4470 3.4703 2.2969 0.3490
hfenergy: -692.6998186 hartree
pointgroup: C01 [X(C4H9Cl1O1)]
dipole: 0.575827 1.1896404 0.0904156 debye
dipolederiv: -0.3024826 -0.1329783 0.022882 -0.2032042 -0.4429152 0.0696778 0.0653108 0.1221237 -0.2248261 -1.1700745 0.1499819 -0.0428787 0.1954654 -0.4372314 0.0194673 -0.0421772 -0.0035808 -0.4191475 0.5962134 -0.1739457 -0.0963779 -0.4193089 0.3398022 -0.0203834 -0.1900417 0.0127056 0.3037284 0.8363494 0.0155869 0.0772608 0.1029932 0.3546319 -0.067067 0.2052806 -0.076664 0.4115458 0.2348472 0.2213348 -0.0818843 0.2732826 0.5916114 -0.1543009 -0.1126632 -0.1532604 0.2281719 -0.0884165 0.0769621 0.0382174 0.0818322 -0.0147001 -0.0271459 0.0322844 -0.0291731 0.0441444 -0.0713791 -0.0998185 0.0311434 0.0729178 -0.2202881 0.0588497 0.0103777 0.0697621 0.0513914 -0.0041965 0.0221001 -0.0157077 0.0821985 0.0525083 0.0121279 0.0662259 -0.0601031 -0.1861974 -0.0660243 -0.0162165 -0.0134706 -0.1232884 -0.2308416 0.0174568 -0.0233218 0.0596854 0.0365036 -0.046441 0.0121952 0.059814 -0.0165493 0.0487728 0.0130915 -0.054257 0.0036702 -0.2391609 -0.0625987 0.0499782 0.0276915 0.0600999 -0.0943091 0.0309741 0.0469082 0.0114251 0.087451 0.0959163 -0.0389451 0.0506236 -0.0692042 0.0032606 0.0100995 0.0096873 0.0190859 -0.0894317 -0.1503121 -0.0112698 -0.0830198 -0.0277596 0.0887106 -0.03235 -0.1033246 -0.0249245 0.057372 0.0909491 -0.0806558 0.0208192 -0.0270329 -0.1201982 0.0319022 0.0348449 0.0393845 0.087231 0.1076499 0.0056906 0.004887 0.0175579 0.081186 0.0376003 0.0548658 0.0098635 -0.148776 unknown
polarizability: 64.8807722|3.0394845|57.055639|-1.6443568|-4.0932422|45.9606336 unknown
InChI: InChI=1S/C4H9ClO/c1-2-6-4-3-5/h2-4H2,1H3
charge 0 multiplicity 1
15 atoms
Cl -2.546442 -1.096155 0.431432
O  0.448935 0.060934 -0.265978
C  -0.604265 0.946248 0.216655
C  1.751503 0.338845 0.359596
C  -1.926555 0.493064 -0.377716
C  2.758209 -0.651134 -0.223742
H  -0.411079 1.994017 -0.119165
H  -0.653637 0.94754 1.327471
H  2.055937 1.389198 0.148767
H  1.667864 0.219998 1.462806
H  -2.720688 1.235328 -0.206943
H  -1.823276 0.262587 -1.448048
H  3.757358 -0.493658 0.221585
H  2.439532 -1.68715 -0.017774
H  2.836406 -0.524762 -1.317246
