program: Gaussian 09
title: 000213756
version: EM64L-G09RevD.01
frameworkgroup: C1[X(C16H27NO)]
method: RPBEPBE
basis: SDD
operation: Freq
keyword: #p
keyword: freq=noraman
keyword: PBEPBE/SDD
title: #p freq=noraman PBEPBE/SDD
converged: YES YES NO NO
title: Mulliken charges:
elementType: O N C C C C C C C C C C C C C C C C H H H H H H H H H H H H H H H H H H H H H H H H H H H
charge: -0.285866 -0.132091 -0.030417 -0.042568 -0.399570 -0.243147 -0.699557 -0.691601 -0.693779 -0.688802 -0.227454 -0.561523 0.467536 -0.447482 -0.382700 -0.219055 -0.226603 -0.248312 0.195418 0.198805 0.209725 0.213961 0.202563 0.186000 0.211078 0.205741 0.237128 0.226577 0.201471 0.208954 0.210131 0.208751 0.217968 0.227961 0.207465 0.201830 0.189732 0.196495 0.199518 0.228744 0.226736 0.273008 0.221839 0.220683 0.224710
chargesum: 0.00000
title: Mulliken charges with hydrogens summed into heavy atoms:
elementType: O N C C C C C C C C C C C C C C C C
charge: -0.285866 -0.132091 0.165001 0.156237 0.024116 0.145415 -0.045610 -0.054599 -0.056928 -0.051546 0.158774 -0.133262 0.467536 -0.220746 -0.109692 0.002784 -0.005919 -0.023602
polarizability: 2.16702456e+02 -9.92039598e+00 1.85519334e+02 -1.38427301e+01 -1.09591319e+01 1.45048457e+02
1716.lowfreq: -9.3346 -0.0007 -0.0005 0.0003 3.5300 5.7084 14.1112 17.5442 27.6913
frequency: 11.9061 16.9819 27.5945 45.5983 50.9496 65.9231 98.2578 114.6806 132.9047 145.4835 153.4390 172.6400 195.4367 219.6280 222.3932 241.3702 272.7490 283.4924 291.3184 304.8870 327.2919 347.9478 390.1578 393.1798 405.4450 449.6358 477.4463 494.8739 526.1233 559.3744 574.9817 617.9772 701.0191 706.7510 751.4496 770.5408 787.9341 825.0201 835.9769 855.5987 875.5228 902.0690 903.5486 917.8501 921.3671 925.6330 962.2098 976.3125 977.0598 982.7573 990.5569 994.5229 1026.3346 1032.1921 1050.7041 1074.5105 1080.9560 1088.7622 1091.6664 1115.1916 1125.5517 1144.3584 1163.4051 1167.2056 1170.0591 1185.6531 1189.2913 1211.5763 1216.8717 1235.6992 1240.4909 1285.4940 1298.5707 1304.4234 1313.3414 1322.5516 1341.5715 1355.5247 1365.8247 1366.5863 1371.2389 1379.8146 1381.9366 1387.3332 1389.9076 1398.5724 1439.5156 1455.1186 1456.3269 1461.9308 1462.5466 1468.1649 1471.3379 1473.5076 1478.7568 1479.4152 1481.6709 1486.1164 1488.5470 1489.2238 1591.0960 1614.8018 2915.3672 2920.7729 2929.4860 2967.5853 2971.4058 2972.2418 2977.5793 2978.5412 2979.9930 2982.6797 2990.8413 3003.9642 3043.5325 3052.5087 3060.7740 3063.7580 3070.2760 3071.7205 3077.0965 3086.7568 3089.4252 3094.2973 3110.8473 3121.4504 3135.5892 3152.7814 3164.5909
redmass: 3.8647 4.0402 3.5334 3.5016 3.0041 2.5915 2.4785 2.9073 4.1336 2.8035 3.2947 2.1014 1.2686 1.2348 1.1420 2.2291 2.3897 1.0857 2.5194 2.6203 2.7064 2.6617 2.1864 2.8427 2.8275 2.6298 2.9567 3.7159 2.9795 2.5089 2.7224 6.1577 2.9111 1.7502 2.7657 2.1473 1.2589 2.5593 2.2413 1.2466 2.4098 1.3293 1.2491 1.3691 1.3152 1.3782 2.5701 2.5786 1.5167 1.8173 3.5598 1.5198 2.8333 2.2248 2.4224 3.1034 1.9376 1.8899 1.7988 2.2307 2.2499 1.9039 1.9423 1.4571 1.0641 1.2349 1.1342 2.5734 2.0050 1.3504 1.5261 1.1645 1.3503 1.3442 1.2491 1.3655 1.4472 1.3098 1.3012 1.2446 1.2238 1.2810 6.3537 1.2247 1.2724 1.3961 2.0342 1.1420 1.0558 1.0586 1.0521 1.0671 1.0734 1.0665 1.0744 1.0748 1.3989 1.2248 1.1798 1.0733 6.0226 6.0977 1.0558 1.0685 1.0569 1.0971 1.0349 1.0362 1.0815 1.0369 1.0409 1.0994 1.0688 1.0837 1.1004 1.0929 1.0991 1.0995 1.0991 1.0980 1.0995 1.0998 1.0999 1.0986 1.0865 1.0868 1.0929 1.0966 1.0990
irintensity: 0.0858 0.0209 0.0756 0.0819 0.1243 0.3228 0.0366 1.4549 6.6374 5.5056 1.5177 1.1777 0.1971 0.8257 0.1697 0.3974 0.8355 0.1236 0.2285 0.5671 0.6192 4.6883 1.1971 1.2930 0.1176 3.7811 9.1396 3.9066 9.1973 4.3332 15.1789 0.7765 3.7406 58.8900 21.4106 24.9336 3.7066 4.9261 2.2769 0.6055 3.2807 0.7834 2.2076 2.8645 0.6208 0.3129 5.7937 22.0248 4.8397 11.1441 0.2230 3.0401 41.8834 51.7122 61.2108 51.1992 40.6771 6.5556 26.5489 3.4944 27.1690 21.7592 14.0440 50.3814 0.9514 0.7323 1.1846 61.5566 0.1884 12.4075 40.7978 11.5542 6.1794 3.8891 16.6080 4.1378 2.1905 14.7514 7.2804 9.0288 42.4229 7.0813 0.3512 7.8250 34.0048 6.0845 4.3439 16.4451 0.4371 2.8229 3.8290 5.7012 14.1990 3.9255 26.2624 6.3403 6.4352 10.7012 11.9707 9.4797 0.6244 7.9591 46.4859 14.0495 122.8988 32.4709 26.1197 22.9734 22.1214 27.9617 26.9063 55.9083 62.7912 14.6866 24.5247 35.5663 2.2412 3.4480 73.7924 80.3682 97.2566 25.0009 46.4543 33.7946 9.7591 1.8036 36.6718 30.5072 12.8128
temp: 298.150 k
press: 1.00000 atm
elementType: 8 7 6 6 6 6 6 6 6 6 6 6 6 6 6 6 6 6 1 1 1 1 1 1 1 1 1 1 1 1 1 1 1 1 1 1 1 1 1 1 1 1 1 1 1
symmnumber: 1
zpe: 1039871.1 jmol-1
zpe.correction: 0.396066 hartree
zpe.thermalcorrener: 0.416985 hartree
zpe.thermalcorrenthalpy: 0.417930 hartree
zpe.thermalcorrgfe: 0.343297 hartree
zpe.sumelectzpe: -754.412814 hartree
zpe.sumelectthermal: -754.391895 hartree
zpe.sumelectthermalent: -754.390951 hartree
zpe.sumelectthermalfe: -754.465583 hartree
dipole: 1.1627 -0.1903 1.0095
dipole: 1.5515
quadrupole: -108.1659 -106.5964 -113.3497
quadrupole: 2.1088 -5.2585 -2.9046
quadrupole: 1.2048 2.7742 -3.9790 2.1088 -5.2585 -2.9046
hfenergy: -754.8088804 hartree
pointgroup: C01 [X(C16H27N1O1)]
dipole: 0.4911324 -0.2866413 0.2218173 debye
polarizability: 214.0175877|5.137435|179.2324292|-21.7408461|17.1547446|154.0202301 unknown
InChI: InChI=1S/C16H27NO/c1-14(2)17(15(3)4)11-13-18-12-10-16-8-6-5-7-9-16/h5-9,14-15H,10-13H2,1-4H3
charge 0 multiplicity 1
45 atoms
O  -0.499031 -0.848008 -0.676192
N  3.040463 0.138672 0.046328
C  4.177947 0.276257 -0.901634
C  3.187004 0.674715 1.427462
C  1.677342 0.208866 -0.51173
C  0.850978 -1.031651 -0.126863
C  4.149482 1.55039 -1.799288
C  4.308697 -0.992383 -1.781175
C  3.434146 2.210248 1.512974
C  4.257145 -0.098565 2.23433
C  -1.392928 -1.9706 -0.362141
C  -2.783424 -1.667821 -0.95049
C  -3.588868 -0.62496 -0.185028
C  -4.842316 -0.962602 0.387277
C  -3.111229 0.704907 -0.032897
C  -5.602716 -0.003128 1.09588
C  -3.86853 1.664411 0.675006
C  -5.117394 1.316141 1.241999
H  5.089116 0.334897 -0.27527
H  2.211736 0.476827 1.917496
H  1.124441 1.115243 -0.176519
H  1.716985 0.261647 -1.614202
H  1.323065 -1.946195 -0.547097
H  0.801825 -1.144265 0.979169
H  5.076834 1.613695 -2.399525
H  3.300207 1.525942 -2.507563
H  4.06629 2.470146 -1.196092
H  4.421705 -1.888308 -1.14647
H  5.183036 -0.918388 -2.455205
H  3.410552 -1.130643 -2.412884
H  3.372945 2.554065 2.562832
H  4.437703 2.474612 1.131662
H  2.680351 2.767579 0.926644
H  4.048419 -1.18217 2.20512
H  4.262571 0.23638 3.288276
H  5.273671 0.067433 1.830981
H  -0.9847 -2.902411 -0.814889
H  -1.450788 -2.113635 0.739603
H  -3.352031 -2.616786 -0.988295
H  -2.627706 -1.344288 -1.998601
H  -5.228243 -1.984006 0.274792
H  -2.140394 0.967986 -0.464809
H  -6.569603 -0.284242 1.529288
H  -3.486153 2.686282 0.783643
H  -5.704496 2.063215 1.788396
