program: Gaussian 09
title: 000220160
version: EM64L-G09RevD.01
frameworkgroup: C1[X(C11H14O4)]
method: RPBEPBE
basis: SDD
operation: Freq
keyword: #pfreq=noraman
keyword: PBEPBE/SDD
title: #p freq=noraman PBEPBE/SDD
converged: YES YES NO NO
title: Mulliken charges:
elementType: O O O O C C C C C C C C C C C H H H H H H H H H H H H H H
charge: -0.456922 -0.405156 -0.431612 -0.329401 0.171622 0.396142 -0.745710 -0.724841 -0.724723 0.193608 -0.526488 0.097746 -0.545810 0.174479 0.151713 0.219150 0.221082 0.219271 0.213525 0.205698 0.264802 0.205812 0.213423 0.264777 0.283604 0.256961 0.357105 0.389485 0.390658
chargesum: 0.00000
title: Mulliken charges with hydrogens summed into heavy atoms:
elementType: O O O O C C C C C C C C C C C
charge: -0.099817 -0.015671 -0.040954 -0.329401 0.171622 0.396142 -0.086207 -0.040815 -0.040711 0.193608 -0.242884 0.097746 -0.288849 0.174479 0.151713
polarizability: 2.02961358e+02 8.63264767e-01 1.41976642e+02 5.45761240e-04 -6.33631559e-03 7.85187660e+01
1716.lowfreq: -3.3023 -0.0009 -0.0008 0.0002 2.5093 8.2247 58.8715 66.9759 114.0366
frequency: 58.8653 66.9629 114.0360 159.5061 169.9644 179.1219 211.3323 230.8053 247.6019 251.9727 304.8318 311.9701 322.7696 329.5262 338.4742 372.6837 387.5044 406.9651 436.5950 451.8623 460.5077 477.5090 553.3861 572.2841 603.5659 638.8677 659.6724 710.4899 729.2494 745.4063 792.6935 813.0947 833.8316 859.3344 897.9848 924.0103 932.3333 950.0581 987.9184 1023.1297 1030.9325 1059.3682 1125.8454 1148.2658 1201.6115 1206.5936 1217.6299 1234.2387 1256.9416 1285.5573 1305.3459 1371.0614 1375.3006 1381.1366 1403.5281 1409.3805 1431.8108 1457.3986 1470.8942 1475.6670 1478.8698 1491.0172 1501.4558 1505.2232 1566.7677 1583.7952 1652.4089 2974.8720 2978.9288 2983.0554 3066.0805 3069.1100 3073.5612 3077.5831 3090.2279 3109.6628 3113.7623 3136.5748 3190.7926 3531.0418 3575.7515
redmass: 5.0475 3.4608 9.1803 4.8142 6.3019 2.1965 1.3288 2.6117 1.3741 3.2281 3.1914 3.1040 1.0541 1.1641 5.8009 2.7227 3.4360 3.5860 5.0054 3.4974 9.5188 3.2595 3.9317 1.2870 3.8478 4.4616 4.8652 6.4724 5.5891 3.6942 4.5910 1.1121 2.9678 1.5577 1.4920 1.7030 1.6932 1.2090 6.1018 1.4489 1.3805 2.6773 1.7313 1.5630 2.8956 2.0964 2.4566 1.8587 1.8701 3.8885 1.7331 1.1783 1.2691 3.4917 1.6301 3.4183 2.6324 1.0477 1.1014 1.0480 1.0885 1.0500 2.5594 1.0994 4.2920 6.8565 5.5685 1.0355 1.0361 1.0370 1.1003 1.0994 1.1000 1.0983 1.0679 1.0988 1.0979 1.0915 1.0906 1.0641 1.0659
irintensity: 0.6543 0.0037 0.0901 0.1781 0.0277 0.4205 0.0107 0.8146 0.8944 0.5840 9.2901 7.2512 1.7024 93.2495 2.4410 4.3842 11.1395 21.7583 3.3005 3.7645 0.7259 13.4561 29.7804 111.8683 20.2164 29.8891 20.9888 6.1587 2.7039 3.1685 20.1906 174.5369 37.9316 17.4130 8.4491 4.4358 4.4645 0.3077 65.9625 24.2485 1.0400 279.7529 219.1739 152.8631 5.7904 19.4148 1.3085 80.7568 64.7918 9.9499 181.1671 23.8884 45.6006 152.4037 20.7083 20.4256 115.5092 0.1371 11.6905 0.0007 30.5846 11.9608 93.4599 36.7937 34.6982 155.7884 203.2469 19.2887 41.8913 49.0071 5.8231 10.2110 46.6415 105.5459 204.0343 0.6906 20.0475 5.3977 0.9164 73.1645 28.0364
temp: 298.150 k
press: 1.00000 atm
elementType: 8 8 8 8 6 6 6 6 6 6 6 6 6 6 6 1 1 1 1 1 1 1 1 1 1 1 1 1 1
symmnumber: 1
zpe: 604818.3 jmol-1
zpe.correction: 0.230363 hartree
zpe.thermalcorrener: 0.245297 hartree
zpe.thermalcorrenthalpy: 0.246241 hartree
zpe.thermalcorrgfe: 0.189851 hartree
zpe.sumelectzpe: -727.354090 hartree
zpe.sumelectthermal: -727.339157 hartree
zpe.sumelectthermalent: -727.338213 hartree
zpe.sumelectthermalfe: -727.394603 hartree
dipole: 0.1884 -3.1517 0.0063
dipole: 3.1573
quadrupole: -83.0658 -85.9047 -91.4325
quadrupole: 11.0053 -0.0105 -0.0036
quadrupole: 3.7352 0.8963 -4.6315 11.0053 -0.0105 -0.0036
hfenergy: -727.5844534 hartree
pointgroup: C01 [X(C11H14O4)]
dipole: -0.091507 1.2376041 0.0548828 debye
polarizability: 202.9207679|1.7475461|141.9018138|-0.6658729|2.6527714|78.6341836 unknown
InChI: InChI=1S/C11H14O4/c1-11(2,3)7-5-8(12)6(10(14)15)4-9(7)13/h4-5,12-14H,1-3H3
charge 0 multiplicity 1
29 atoms
O  -1.399596 2.316996 0.075729
O  1.833873 -2.27964 -0.135513
O  3.641912 1.586533 0.013733
O  3.931343 -0.71097 -0.085453
C  -2.720535 -0.29328 -0.027389
C  -1.18486 -0.121052 -0.029337
C  -3.139298 -1.785751 -0.08882
C  -3.328511 0.42699 -1.271384
C  -3.311759 0.316496 1.282098
C  -0.561812 1.177572 0.022458
C  -0.323598 -1.235454 -0.080835
C  1.087503 -1.116429 -0.08348
C  0.830263 1.321786 0.020447
C  1.682757 0.184618 -0.032497
C  3.137012 0.289494 -0.037134
H  -2.769022 -2.356788 0.782513
H  -4.242538 -1.848293 -0.083736
H  -2.781795 -2.279502 -1.01124
H  -2.938504 -0.013046 -2.207801
H  -4.42782 0.30365 -1.26642
H  -3.096719 1.503335 -1.263615
H  -4.411288 0.196274 1.279335
H  -2.912147 -0.205302 2.171335
H  -3.077016 1.388871 1.366116
H  -0.72607 -2.24894 -0.120901
H  1.293752 2.314642 0.059871
H  -0.852824 3.141034 0.108806
H  2.819035 -2.027326 -0.129739
H  4.635658 1.543379 0.004957
