program: Gaussian 09
title: 000220142
version: EM64L-G09RevD.01
frameworkgroup: C1[X(C12H16ClNO2)]
method: RPBEPBE
basis: SDD
operation: Freq
keyword: #p
keyword: freq=noraman
keyword: PBEPBE/SDD
title: #p freq=noraman PBEPBE/SDD
converged: YES YES NO NO
title: Mulliken charges:
elementType: Cl O O N C C C C C C C C C C C C H H H H H H H H H H H H H H H H
charge: -0.068051 -0.308741 -0.266488 -0.468161 -0.342571 -0.385322 -0.351990 -0.264452 -0.691626 0.258815 0.512821 -0.438963 -0.370361 -0.040691 -0.187384 -0.259149 0.190284 0.190286 0.209701 0.209685 0.197131 0.197148 0.227076 0.227029 0.210894 0.210887 0.218787 0.334324 0.253125 0.305511 0.232806 0.257639
chargesum: 0.00000
title: Mulliken charges with hydrogens summed into heavy atoms:
elementType: Cl O O N C C C C C C C C C C C C
charge: -0.068051 -0.308741 -0.266488 -0.133837 0.038000 0.034064 0.042289 0.189653 -0.051057 0.258815 0.512821 -0.185838 -0.064850 -0.040691 0.045422 -0.001511
polarizability: 2.47193447e+02 8.21913516e+00 1.51567012e+02 -1.64925446e-02 1.11393672e-02 8.31966855e+01
1716.lowfreq: -40.1238 -2.4768 -2.2679 -0.0030 -0.0028 -0.0023 16.4291 20.9219 35.8722
frequency: -34.4123 20.7920 35.8102 58.7772 63.0501 84.9119 108.5972 112.4583 162.8430 179.1409 185.9638 190.4060 237.0436 251.6243 254.1954 320.8821 360.3609 406.8786 412.3483 438.9620 460.0990 560.0823 609.7257 641.7822 664.2815 684.5402 703.5225 727.0171 729.9240 762.9632 788.2939 842.0989 853.4531 861.0888 884.7690 908.6365 921.9051 963.7324 978.4339 989.4832 1008.9333 1026.5363 1068.9527 1073.9707 1077.7644 1097.0134 1126.7000 1152.4728 1162.2347 1180.7925 1203.2653 1249.4850 1252.1401 1257.3754 1280.1012 1290.2513 1308.3327 1315.8685 1352.4246 1366.5511 1380.7998 1391.5025 1415.4911 1465.0105 1466.3307 1475.1340 1475.4490 1479.1326 1484.2246 1489.7353 1515.5615 1585.8654 1615.1478 1662.8841 2957.2120 2968.9962 2974.2848 2989.2340 2996.9052 3000.9024 3023.9798 3044.5491 3070.3795 3074.2031 3075.6344 3146.5811 3147.7705 3179.6952 3194.2359 3543.7434
redmass: 1.7583 3.9798 5.4327 5.9238 4.1661 2.2401 4.9311 2.5128 3.3187 6.0582 5.2911 4.9994 1.0924 4.2953 7.3539 4.2093 5.8242 6.7450 5.1785 3.0428 3.4319 4.1081 6.4552 1.3707 7.4517 2.3292 5.6440 1.0705 8.6917 1.1069 1.3165 1.1770 5.8146 1.5879 2.5337 1.3642 3.9065 1.1547 5.9351 1.3102 4.9652 5.2043 2.4198 2.0253 2.6005 1.5278 2.6217 1.5091 3.2835 1.0896 1.4122 1.5507 1.4181 1.2141 1.0969 1.0891 1.5268 1.3474 1.5566 2.0638 2.7041 1.2219 3.1806 1.0680 1.0821 1.0875 2.4996 1.0423 1.0768 1.0965 2.3082 5.1664 6.5107 8.4569 1.0586 1.0592 1.0362 1.0596 1.0990 1.0565 1.1028 1.1043 1.1018 1.0993 1.1072 1.0902 1.0915 1.0951 1.0959 1.0762
irintensity: 0.0553 0.0382 0.0063 3.4754 0.9075 1.2906 0.9124 0.8810 2.7790 1.0137 1.5862 3.6736 0.0001 4.1935 7.6916 6.8487 4.3760 11.8380 2.3756 7.6920 3.2772 4.0667 3.5301 47.0914 12.9138 29.3374 42.9960 11.4036 28.1343 0.0156 55.5641 0.9768 80.6815 48.9158 0.5796 4.0469 12.6107 1.1189 13.3105 3.7863 72.7078 136.8655 72.5698 25.4110 35.1015 20.6988 3.4077 0.4485 577.0589 0.2925 0.5631 7.5541 12.8731 0.0209 0.2973 0.7033 17.6148 0.0708 9.1976 111.9463 30.3818 12.6828 83.8842 0.3848 0.4951 6.1511 93.2672 12.9980 4.6027 39.9833 425.1082 177.9536 169.5798 212.8330 6.5476 51.7105 36.9071 19.6502 0.7268 45.7342 17.4401 11.0917 29.1637 50.6026 118.9334 12.7714 1.7920 2.3474 6.2153 31.1635
temp: 298.150 k
press: 1.00000 atm
elementType: 17 8 8 7 6 6 6 6 6 6 6 6 6 6 6 6 1 1 1 1 1 1 1 1 1 1 1 1 1 1 1 1
symmnumber: 1
zpe: 679255.3 jmol-1
zpe.correction: 0.258715 hartree
zpe.thermalcorrener: 0.274980 hartree
zpe.thermalcorrenthalpy: 0.275924 hartree
zpe.thermalcorrgfe: 0.212363 hartree
zpe.sumelectzpe: -1130.944878 hartree
zpe.sumelectthermal: -1130.928612 hartree
zpe.sumelectthermalent: -1130.927668 hartree
zpe.sumelectthermalfe: -1130.991230 hartree
dipole: 2.9144 -0.8297 -0.0010
dipole: 3.0302
quadrupole: -99.0492 -102.8584 -104.8719
quadrupole: -8.5067 0.0020 -0.0010
quadrupole: 3.2107 -0.5986 -2.6121 -8.5067 0.0020 -0.0010
hfenergy: -1131.2035923 hartree
pointgroup: C01 [X(C12H16Cl1N1O2)]
dipole: -1.1603459 0.2735771 -0.0024836 debye
polarizability: 246.2408417|12.5583589|152.5190885|0.2385818|-0.093617|83.1972143 unknown
InChI: InChI=1S/C12H16ClNO2/c1-2-3-4-8-16-12(15)14-11-7-5-6-10(13)9-11/h5-7,9,14H,2-4,8H2,1H3
charge 0 multiplicity 1
32 atoms
Cl 5.704878 2.1589 0.00533
O  -1.422056 0.281051 -0.004134
O  -0.251796 -1.7638 0.001714
N  0.83226 0.350248 -0.00125
C  -5.224298 -0.137996 -0.006882
C  -3.837251 0.547638 -0.008159
C  -6.392154 0.874481 -0.012417
C  -2.704964 -0.478581 -0.003052
C  -7.776414 0.191225 -0.010902
C  -0.259411 -0.508298 -0.001673
C  2.2079 0.002081 0.001965
C  3.145315 1.071422 0.002126
C  2.66641 -1.342795 0.004868
C  4.516511 0.771417 0.005163
C  4.053875 -1.596428 0.007867
C  5.00425 -0.5487 0.008078
H  -5.315381 -0.793604 0.884118
H  -5.313378 -0.80108 -0.892535
H  -3.740777 1.202379 0.879331
H  -3.738928 1.195402 -0.900552
H  -6.304225 1.537424 0.872253
H  -6.302431 1.529815 -0.902557
H  -2.72795 -1.129814 -0.89661
H  -2.730189 -1.12339 0.89511
H  -7.902634 -0.453058 -0.901314
H  -7.904304 -0.445689 0.884564
H  -8.593524 0.935528 -0.014738
H  0.59477 1.344605 -0.003497
H  2.809439 2.113739 -0.000064
H  1.942795 -2.159754 0.004744
H  4.405641 -2.63362 0.010088
H  6.078223 -0.751047 0.010416
