program: Gaussian 09
title: 000220136
version: EM64L-G09RevD.01
frameworkgroup: C1[X(C17H14O5)]
method: RPBEPBE
basis: SDD
operation: Freq
keyword: #pfreq=noraman
keyword: PBEPBE/SDD
title: #p freq=noraman PBEPBE/SDD
converged: YES YES NO NO
title: Mulliken charges:
elementType: O O O O O C C C C C C C C C C C C C C C C C H H H H H H H H H H H H H H
charge: -0.285165 -0.287643 -0.225934 -0.220223 -0.217950 0.302070 0.304265 0.005073 -0.359807 -0.355950 -0.341399 -0.342740 0.345392 0.347037 -0.328317 -0.323065 -0.398350 -0.405035 0.268895 0.270805 -0.755894 -0.756760 0.269625 0.274879 0.277549 0.271977 0.304617 0.306662 0.260703 0.260385 0.261204 0.252777 0.253447 0.260236 0.253516 0.253119
chargesum: 0.00000
title: Mulliken charges with hydrogens summed into heavy atoms:
elementType: O O O O O C C C C C C C C C C C C C C C C C
charge: -0.285165 -0.287643 -0.225934 -0.220223 -0.217950 0.302070 0.304265 0.005073 -0.090183 -0.081071 -0.063850 -0.070763 0.345392 0.347037 -0.023700 -0.016403 -0.137647 -0.144649 0.268895 0.270805 0.011534 0.010111
polarizability: 3.62217717e+02 -9.13355312e-01 2.00401327e+02 -1.45376453e+01 -3.45766898e+00 1.09277383e+02
1716.lowfreq: -75.0268 -71.0427 -3.1894 0.0002 0.0005 0.0009 2.0433 7.4614 17.9676
frequency: -75.0239 -71.0426 17.9137 22.4906 31.9313 41.4199 59.1966 67.3971 92.4945 118.8027 134.3781 138.7162 177.8762 213.1328 228.3271 276.4232 296.4862 310.5183 344.7274 347.8678 387.6797 410.4065 413.8792 422.1483 496.1975 498.0440 537.3390 538.8396 565.3100 565.7964 587.7423 620.3324 624.5432 659.3559 676.0520 691.4242 735.1490 744.9812 766.7232 775.2100 843.1832 853.7535 866.5757 875.5341 880.8039 882.4794 917.5755 974.1464 984.0420 994.2144 997.3883 997.8193 998.5349 1008.5005 1011.5933 1044.9628 1044.9781 1115.5840 1120.0222 1143.3195 1151.6471 1153.1652 1165.9675 1168.6190 1200.4180 1204.5606 1286.0527 1301.5875 1305.8429 1370.8737 1373.1442 1385.9632 1386.0485 1413.1014 1413.8969 1453.3806 1453.4894 1457.7653 1457.8066 1482.5294 1488.8285 1529.0740 1572.0675 1581.3979 1608.0892 1612.6901 1657.2246 1658.9977 3009.2628 3009.2970 3095.2518 3095.3688 3145.6761 3146.4153 3149.1445 3153.9907 3155.7960 3157.7751 3174.2175 3175.8574 3210.9705 3212.8749
redmass: 1.0437 1.0484 8.1551 7.4254 4.8206 4.0771 4.2316 5.1907 4.3591 6.7357 7.0007 5.7877 6.9043 7.1415 5.1744 6.7585 6.5676 6.1247 5.3172 5.5961 4.2196 2.9662 5.2657 3.0882 4.3970 3.5289 3.4827 4.5753 3.3686 3.3951 4.6786 6.9077 6.9105 5.7726 4.4917 6.1295 4.2518 6.9072 6.3729 3.6610 1.3101 1.3029 1.4802 1.8454 6.9423 6.2902 5.5622 1.3511 1.3576 1.3594 1.6900 1.7192 1.6573 2.8650 2.4206 1.6055 1.6061 1.3291 1.3246 2.5289 3.6499 2.4232 3.0049 3.1808 1.4829 1.5121 3.4420 1.3420 1.2898 6.2531 5.9727 1.2242 1.2192 3.8729 3.8583 1.0611 1.0621 1.0455 1.0456 2.3912 2.6128 10.9571 7.2874 7.7786 6.3142 6.5497 11.0899 11.1005 1.0369 1.0370 1.0971 1.0971 1.1009 1.1008 1.0895 1.0896 1.0884 1.0912 1.0966 1.0972 1.0945 1.0946
irintensity: 1.2223 1.3025 0.2959 6.3452 0.8404 1.3801 0.2843 0.8683 0.1656 1.6928 7.1753 3.8182 0.5499 0.9648 5.3429 3.8545 4.6093 3.8624 2.7872 1.1034 0.6473 0.9323 15.1764 0.1770 9.3600 11.6166 0.4853 6.6959 1.4410 0.4467 3.1416 5.4022 1.5863 76.3369 13.5787 7.0482 3.4364 18.4638 2.9584 50.2063 20.0548 9.7812 30.7814 83.3687 150.6161 19.0841 105.2367 1.6377 5.7778 18.6601 97.7427 37.0950 20.7176 6.1823 32.3974 3.5437 16.4626 17.4279 33.7706 1224.3254 15.9828 134.5741 409.9461 159.8366 68.7952 33.7915 418.4516 33.2619 23.3303 29.7402 0.0606 76.6703 39.3194 17.5146 30.7691 17.1195 14.0371 16.6352 19.5618 18.8393 35.6756 153.3277 6.0723 66.8286 187.3323 26.3687 193.5701 202.1086 2.7093 2.3212 5.0008 5.0450 6.9942 6.4961 13.2990 0.8828 0.4692 1.6339 3.6678 5.4537 3.1360 3.0147
temp: 298.150 k
press: 1.00000 atm
elementType: 8 8 8 8 8 6 6 6 6 6 6 6 6 6 6 6 6 6 6 6 6 6 1 1 1 1 1 1 1 1 1 1 1 1 1 1
symmnumber: 1
zpe: 702078.7 jmol-1
zpe.correction: 0.267408 hartree
zpe.thermalcorrener: 0.286539 hartree
zpe.thermalcorrenthalpy: 0.287483 hartree
zpe.thermalcorrgfe: 0.216248 hartree
zpe.sumelectzpe: -1030.784596 hartree
zpe.sumelectthermal: -1030.765465 hartree
zpe.sumelectthermalent: -1030.764521 hartree
zpe.sumelectthermalfe: -1030.835755 hartree
dipole: -1.5735 -3.5603 1.7564
dipole: 4.2704
quadrupole: -89.8804 -135.1645 -127.3476
quadrupole: -16.1291 1.8033 -1.2318
quadrupole: 27.5838 -17.7003 -9.8834 -16.1291 1.8033 -1.2318
hfenergy: -1031.0520036 hartree
pointgroup: C01 [X(C17H14O5)]
dipole: 0.5569906 1.090237 1.1506279 debye
polarizability: 361.2385445|-3.2589931|187.2053475|20.8474901|32.2648721|123.4525346 unknown
InChI: InChI=1S/C17H14O5/c1-11(18)21-15-7-3-13(4-8-15)17(20)14-5-9-16(10-6-14)22-12(2)19/h3-10H,1-2H3
charge 0 multiplicity 1
36 atoms
O  5.260745 0.376056 0.248755
O  -4.942626 1.036322 0.474659
O  -0.069935 -2.784796 -1.344839
O  5.030495 2.723312 0.294934
O  -6.45687 0.240403 -1.150341
C  1.319432 -1.022609 -0.490213
C  -1.286958 -0.894614 -0.497591
C  -0.016149 -1.6317 -0.807323
C  1.55014 0.377772 -0.47359
C  -2.441196 -1.194939 -1.267634
C  2.420645 -1.89808 -0.278868
C  -1.405916 0.027604 0.578824
C  3.904718 0.014019 -0.004877
C  -3.769722 0.336423 0.063441
C  2.835739 0.911989 -0.238297
C  -3.683848 -0.584003 -1.011653
C  3.702568 -1.387681 -0.027222
C  -2.641764 0.635582 0.862413
C  5.741287 1.702688 0.380357
C  -6.210704 0.946102 -0.153152
C  7.231645 1.675273 0.634223
C  -7.196599 1.830788 0.576252
H  0.727007 1.068637 -0.682174
H  -2.347055 -1.927174 -2.076131
H  2.244398 -2.977249 -0.324357
H  -0.543457 0.24333 1.216964
H  3.003365 1.988846 -0.23837
H  -4.558781 -0.811782 -1.620113
H  4.557235 -2.047225 0.148341
H  -2.755164 1.334521 1.696022
H  7.615158 0.646877 0.678557
H  7.44845 2.197387 1.582335
H  7.746704 2.230905 -0.168888
H  -6.723453 2.356908 1.416515
H  -8.033288 1.212871 0.946452
H  -7.621142 2.562838 -0.132613
