program: Gaussian 09
title: 000220134
version: EM64L-G09RevD.01
frameworkgroup: C1[X(C16H20O4)]
method: RPBEPBE
basis: SDD
operation: Freq
keyword: #pfreq=noraman
keyword: PBEPBE/SDD
title: #p freq=noraman PBEPBE/SDD
converged: YES YES NO NO
title: Mulliken charges:
elementType: O O O O C C C C C C C C C C C C C C C C H H H H H H H H H H H H H H H H H H H H
charge: -0.279455 -0.244127 -0.279829 -0.239572 0.055125 -0.453007 -0.424418 -0.396880 -0.407129 -0.387617 0.163525 0.184534 0.153817 -0.372959 -0.336980 -0.221179 0.171474 -0.222980 -0.257870 -0.664865 0.228413 0.205599 0.212884 0.240828 0.218352 0.204028 0.196014 0.197118 0.204758 0.200956 0.189149 0.268706 0.266848 0.238030 0.236299 0.232201 0.224268 0.218924 0.224727 0.252290
chargesum: 0.00000
title: Mulliken charges with hydrogens summed into heavy atoms:
elementType: O O O O C C C C C C C C C C C C C C C C
charge: -0.279455 -0.244127 -0.279829 -0.239572 0.283538 -0.034524 0.034763 0.003162 -0.005253 0.002488 0.163525 0.184534 0.153817 -0.104253 -0.070132 0.016851 0.171474 0.013319 0.198599 0.031076
polarizability: 2.25687740e+02 -1.63775835e+01 2.01789448e+02 1.48651409e+01 6.51036612e+00 1.28693702e+02
1716.lowfreq: -14.5152 -5.0783 0.0005 0.0008 0.0009 5.6782 9.2825 35.2399 41.4601
frequency: -8.5110 35.1875 41.4004 50.1472 61.1459 77.5388 91.5144 117.1710 129.7686 143.2036 192.1887 213.8908 217.4680 225.6023 244.6548 308.5686 322.1097 333.7989 340.4285 355.0697 403.1602 429.0763 431.7698 445.1170 453.8624 504.6161 523.8417 577.7664 639.9287 670.4418 675.5336 704.2608 749.9474 778.5219 783.6946 786.4318 789.8588 802.7399 816.8495 839.8491 849.1745 876.5424 893.9537 900.9821 913.0879 924.0320 974.8515 997.5608 999.3268 1003.1725 1030.3304 1038.7640 1045.0539 1052.0024 1079.1569 1083.9527 1094.5240 1110.4907 1118.9475 1150.8810 1155.6435 1176.9419 1199.5759 1229.1004 1240.2814 1245.1135 1252.0086 1259.6170 1274.6788 1279.6384 1300.8312 1311.0188 1330.9025 1335.8560 1338.0036 1348.7037 1355.4544 1362.9043 1380.2820 1390.1562 1428.5707 1456.8230 1462.2574 1462.4599 1463.4704 1465.4763 1473.2285 1475.0879 1480.4940 1484.6475 1577.2351 1601.2897 1610.3383 1624.2934 2968.9779 2970.1443 2971.2750 2986.4593 2992.5053 3000.1207 3008.0587 3029.9608 3032.6808 3034.8993 3043.2823 3056.0220 3074.8023 3087.3278 3093.5905 3119.2833 3137.3872 3152.8005 3167.2438 3179.3235
redmass: 3.5047 3.9716 3.1842 4.7068 4.1558 4.4264 4.5961 4.3803 4.2329 4.1864 2.9017 1.6874 1.7779 4.4520 3.2100 3.5084 2.2430 4.0604 4.5628 6.9378 3.7248 3.5221 2.8429 3.4144 2.4916 2.3456 4.7431 3.4166 6.1611 6.0502 5.7811 4.0163 2.9840 2.7766 2.7147 1.4695 1.8822 3.3584 1.5372 2.4863 3.4792 1.7745 1.5726 1.5176 2.9291 1.8497 1.4039 2.8295 2.8232 1.3591 3.9314 4.6727 1.7683 1.1254 2.3424 1.5467 2.1495 2.6741 1.8351 2.3147 1.6787 1.0615 1.5181 3.3851 1.3667 2.5556 1.3010 1.3094 1.3659 1.1960 1.2782 1.3017 1.3552 1.5382 1.4796 1.5411 1.2873 1.4929 10.5686 1.2315 2.1979 1.1031 1.0807 1.0549 1.0900 1.0894 1.0843 2.5229 1.1006 1.0584 7.4102 6.6502 10.7688 9.8840 1.0659 1.0613 1.0626 1.0628 1.0361 1.0761 1.0704 1.0597 1.0956 1.0974 1.1005 1.1026 1.1026 1.0974 1.1029 1.1059 1.0862 1.0911 1.0962 1.0980
irintensity: 0.1236 0.3975 0.5423 2.0850 2.3373 0.3314 0.4225 0.6805 1.5954 1.6197 2.8279 1.5691 1.1928 1.1382 1.9084 9.5702 1.8311 8.9554 3.8425 6.3087 3.4994 1.2328 1.3917 0.9762 0.8325 0.7152 3.2192 4.0192 4.1507 3.1943 3.0624 63.0062 17.1887 13.3614 6.0786 18.3371 15.9511 3.4864 1.4379 10.2155 1.7235 4.1251 15.7869 6.1688 23.6071 0.8866 2.8038 58.9775 12.4063 0.6329 117.5149 186.9250 1.1186 0.4456 185.6140 57.4196 19.6766 1.5427 36.0278 1.2991 34.2077 0.3936 3.8836 163.3844 27.2239 287.4859 8.7147 1.9260 24.4257 6.9814 27.1414 4.4592 0.6169 1.0397 0.6519 0.6479 3.2946 5.3914 9.5873 24.6691 9.4127 16.9081 2.3228 12.7132 7.9292 11.2890 23.5973 17.9788 1.2697 14.0302 35.8163 59.2013 124.0125 148.1571 33.4191 37.2984 36.6996 14.4178 21.0150 1.6966 28.3369 28.9328 67.9215 62.3874 40.8374 52.8423 32.0086 34.8654 1.2134 32.2444 2.2040 9.8640 12.3380 13.7440
temp: 298.150 k
press: 1.00000 atm
elementType: 8 8 8 8 6 6 6 6 6 6 6 6 6 6 6 6 6 6 6 6 1 1 1 1 1 1 1 1 1 1 1 1 1 1 1 1 1 1 1 1
symmnumber: 1
zpe: 863604.8 jmol-1
zpe.correction: 0.328930 hartree
zpe.thermalcorrener: 0.347476 hartree
zpe.thermalcorrenthalpy: 0.348421 hartree
zpe.thermalcorrgfe: 0.281305 hartree
zpe.sumelectzpe: -921.116312 hartree
zpe.sumelectthermal: -921.097765 hartree
zpe.sumelectthermalent: -921.096821 hartree
zpe.sumelectthermalfe: -921.163936 hartree
dipole: 1.2028 2.0583 2.2377
dipole: 3.2696
quadrupole: -98.3588 -105.6802 -125.4235
quadrupole: -2.5135 -0.3291 -3.1617
quadrupole: 11.4620 4.1406 -15.6026 -2.5135 -0.3291 -3.1617
hfenergy: -921.4452418 hartree
pointgroup: C01 [X(C16H20O4)]
dipole: 0.4790061 0.6316313 1.013094 debye
polarizability: 220.0196583|-21.3627335|202.3738531|19.0618791|13.7752403|133.7773784 unknown
InChI: InChI=1S/C16H20O4/c1-2-19-15(17)13-10-6-7-11-14(13)16(18)20-12-8-4-3-5-9-12/h6-7,10-12H,2-5,8-9H2,1H3
charge 0 multiplicity 1
40 atoms
O  -0.972518 -0.720387 0.327956
O  -0.719942 -2.05557 -1.573078
O  2.020772 1.801691 1.197061
O  0.657719 1.431842 -0.661062
C  -2.434066 -0.526549 0.022391
C  -3.109522 -0.211123 1.362849
C  -2.607158 0.605154 -1.006721
C  -4.615549 0.082919 1.144305
C  -4.1136 0.895211 -1.222957
C  -4.824097 1.218856 0.113465
C  -0.228613 -1.442889 -0.592649
C  1.221519 -1.512898 -0.201278
C  1.979829 -0.405916 0.280042
C  1.830631 -2.788304 -0.286936
C  3.312528 -0.614575 0.71769
C  3.162302 -2.983078 0.136602
C  1.456678 0.995732 0.201099
C  3.900542 -1.895134 0.655259
C  1.651542 3.249898 1.161023
C  2.565599 4.021542 0.204584
H  -2.812182 -1.478525 -0.400855
H  -2.616501 0.674359 1.810118
H  -2.970154 -1.055435 2.063191
H  -2.122339 0.323483 -1.957656
H  -2.092114 1.509729 -0.631827
H  -5.08531 0.346253 2.111082
H  -5.122877 -0.835585 0.783006
H  -4.597216 0.012043 -1.689703
H  -4.228462 1.733661 -1.935835
H  -5.905364 1.384353 -0.057329
H  -4.413278 2.163884 0.525143
H  1.241365 -3.621648 -0.682362
H  3.88112 0.24206 1.08938
H  3.617201 -3.976868 0.06745
H  4.931951 -2.03918 0.993993
H  0.592905 3.333695 0.858507
H  1.7759 3.572662 2.20694
H  2.325023 5.100083 0.248882
H  3.62642 3.894345 0.481882
H  2.422516 3.680213 -0.83425
