program: Gaussian 09
title: 000220103
version: EM64L-G09RevD.01
frameworkgroup: C1[X(C9H9ClN2O3)]
method: RPBEPBE
basis: SDD
operation: Freq
keyword: #p
keyword: freq=noraman
keyword: PBEPBE/SDD
title: #p freq=noraman PBEPBE/SDD
converged: YES YES NO NO
title: Mulliken charges:
elementType: Cl O O O N N C C C C C C C C C H H H H H H H H H
charge: 0.044238 -0.278758 -0.205025 -0.169338 -0.138196 0.005389 0.304659 0.158613 -0.431081 -0.376527 0.509611 -0.186906 -0.322915 -0.611686 -0.629542 0.298599 0.282182 0.268448 0.228255 0.229176 0.282362 0.259952 0.238563 0.239930
chargesum: 0.00000
title: Mulliken charges with hydrogens summed into heavy atoms:
elementType: Cl O O O N N C C C C C C C C C
charge: 0.044238 -0.278758 -0.205025 -0.169338 -0.138196 0.005389 0.304659 0.158613 -0.132482 -0.094346 0.509611 0.081541 -0.322915 0.128107 0.108903
polarizability: 1.98588708e+02 -5.49693921e+00 1.43456922e+02 -1.00217715e+00 1.62518615e+00 7.12729011e+01
1716.lowfreq: -11.3736 -2.1639 -0.0019 -0.0010 0.0008 5.2823 40.5725 45.0836 63.9285
frequency: 40.5271 45.0781 63.9265 75.9896 109.6328 125.2644 150.4320 184.5697 202.6715 215.1768 261.2612 270.2374 321.8938 332.4515 348.6347 387.1398 424.8950 463.2476 473.6990 511.6540 590.6865 647.2764 656.5657 661.2200 722.8754 728.8769 733.4969 830.6145 848.2194 922.3084 936.9918 979.7935 1022.3743 1052.0962 1071.8584 1094.5455 1117.0287 1141.7294 1153.2619 1200.1070 1216.6669 1240.3384 1261.5233 1356.1992 1377.2399 1384.7562 1401.6201 1415.8412 1441.0966 1465.3244 1468.7598 1475.0642 1488.2650 1501.8976 1554.3470 1577.1576 1599.8968 2969.8674 2975.4685 3042.7100 3052.2678 3122.2207 3127.1312 3163.2582 3177.4680 3181.5363
redmass: 6.0073 14.8161 4.3652 4.6812 2.3670 1.6441 2.2913 2.0023 6.7625 4.3966 4.4743 3.5242 4.9185 4.7566 10.7066 2.8212 4.0355 4.3273 7.4648 5.5411 5.5824 7.8589 6.8451 6.8666 9.8522 6.0905 4.1071 6.3702 1.4960 2.9207 1.7488 1.3826 6.6765 1.3977 2.1425 1.2252 2.3406 1.3915 1.3766 6.4986 4.0979 4.0560 1.4522 3.6142 11.1062 2.8755 6.1786 1.1799 1.2232 1.9110 1.1523 1.1389 1.0484 1.3121 5.7504 7.1506 6.5730 1.0371 1.0370 1.1012 1.1009 1.0966 1.0977 1.0890 1.0918 1.0973
irintensity: 5.3278 0.2826 1.4155 4.6652 0.9959 0.2079 1.2612 1.3136 0.1101 2.0446 0.8884 5.7201 5.4470 3.9571 4.2858 4.6112 0.5709 10.8527 14.8884 6.5687 14.1286 12.1341 6.9905 5.3769 17.9761 2.3416 12.8707 8.5723 25.8248 3.3172 20.6487 1.3081 70.2990 14.3690 94.8284 0.3589 10.9426 1.8414 2.1946 174.3523 86.6826 66.1419 8.7483 10.9379 70.2296 122.5428 48.1139 44.2325 19.1648 33.3630 18.4142 13.8868 22.2833 13.5491 83.4873 183.0467 41.0997 27.7141 88.8839 35.9505 25.0583 15.9037 1.3993 0.1337 1.1659 1.7269
temp: 298.150 k
press: 1.00000 atm
elementType: 17 8 8 8 7 7 6 6 6 6 6 6 6 6 6 1 1 1 1 1 1 1 1 1
symmnumber: 1
zpe: 449546.1 jmol-1
zpe.correction: 0.171223 hartree
zpe.thermalcorrener: 0.185920 hartree
zpe.thermalcorrenthalpy: 0.186864 hartree
zpe.thermalcorrgfe: 0.128073 hartree
zpe.sumelectzpe: -1142.401568 hartree
zpe.sumelectthermal: -1142.386871 hartree
zpe.sumelectthermalent: -1142.385927 hartree
zpe.sumelectthermalfe: -1142.444718 hartree
dipole: -3.6985 -0.6648 2.8803
dipole: 4.7347
quadrupole: -95.7223 -98.5231 -94.8674
quadrupole: -19.1072 -4.0912 -2.6563
quadrupole: 0.6486 -2.1521 1.5035 -19.1072 -4.0912 -2.6563
hfenergy: -1142.5727911 hartree
pointgroup: C01 [X(C9H9Cl1N2O3)]
dipole: -1.4790329 -0.5774334 0.9741361 debye
dipolederiv: -0.6810194 0.2339007 -0.0087672 0.2152404 -0.0976505 -0.0192336 -0.0521213 -0.0021681 -0.0056813 -0.8411181 -0.120383 -0.2412379 0.0783537 -0.5252491 -0.297079 0.0760948 -0.3249282 -0.8614735 -0.4595498 -0.0174846 0.1156198 -0.0088755 -0.6870313 -0.267573 0.1130917 -0.2227096 -0.4074013 -0.7148175 -0.1594971 0.1683887 -0.1980442 -0.3944006 -0.0558356 0.120177 -0.1032549 -0.3137566 -0.7673693 0.2014787 0.24513 0.261553 -0.5656672 -0.3333797 0.2035865 -0.2775147 -0.6939611 1.0956163 0.4579702 -0.2749035 0.4025391 1.2032688 0.4459264 -0.1950973 0.4368005 0.5442882 -0.1668102 -0.0194921 -0.0342254 0.0549711 -0.1911309 -0.0723001 -0.0309471 -0.090474 -0.0489372 1.3603375 -0.2061507 -0.1039121 -0.4452836 0.6086632 0.6670439 -0.4255585 0.6161835 1.0355809 0.0632546 0.2080534 0.0521794 0.0404003 -0.0173363 0.0262667 0.0462666 -0.0346314 -0.0921662 0.1314579 0.0357367 0.0229421 -0.0888865 0.1298481 0.0497401 -0.011764 0.0961341 -0.0703943 -0.3790953 -0.1788308 -0.0086583 -0.1769067 -0.389339 -0.1461202 -0.0454448 -0.1335728 0.0316942 -0.4930755 -0.0504141 -0.0388824 -0.1243197 0.041013 0.0286229 -0.0655167 0.0310322 -0.0807301 1.0346467 -0.4358619 0.021209 -0.0713849 0.3018087 0.057774 0.1751135 0.0982746 -0.0281772 0.4807851 -0.0942438 -0.1040445 0.0160995 0.2013285 -0.0969913 0.0633095 -0.1224417 0.0106568 0.0065267 0.1423945 0.0808111 0.0465906 0.2833092 0.1060389 -0.0516123 0.0891508 0.3946197 0.1156113 0.0332873 -0.0087541 0.0549694 0.0513547 -0.0235508 0.0070591 -0.0196186 0.1407664 0.0781567 -0.0651162 -0.0234549 -0.0454255 0.0674642 -0.0134685 -0.0016193 -0.0351094 0.1423918 0.0602111 0.0529325 0.0063946 0.0406456 0.0064372 -0.0350057 -0.0114969 -0.0328211 0.1507265 -0.0005396 0.0094707 0.0207105 0.1011845 -0.1522541 -0.0154031 0.0249606 -0.0376057 0.127199 -0.0911178 0.0045289 0.0784367 -0.0700358 0.0336464 0.0917167 0.1471573 0.0834585 -0.0233347 0.1422094 0.001564 -0.0021829 -0.0774699 0.134076 -0.0536332 -0.1014809 -0.0028222 0.0031387 -0.0283018 0.0577888 -0.0963169 0.0839199 0.0261194 0.005869 -0.0932563 0.0033835 0.1023337 -0.0577214 -0.0297971 0.1703818 -0.0525793 0.0761777 0.0216383 0.1058975 -0.0289315 -0.0732151 0.1117226 -0.0618349 -0.0368637 -0.0372556 -0.1444561 -0.0710632 0.0032013 0.0141859 0.0158326 unknown
polarizability: 197.2155158|-9.3005233|131.5450165|-4.2487063|28.3522918|84.5579981 unknown
InChI: InChI=1S/C9H9ClN2O3/c1-11(2)9(13)6-3-4-7(10)8(5-6)12(14)15/h3-5H,1-2H3
charge 0 multiplicity 1
24 atoms
Cl 3.711845 -1.573954 -0.094673
O  -2.928034 -1.013074 -1.350727
O  1.767538 2.248908 1.154915
O  3.491927 1.367841 -0.049719
N  -3.010947 0.358577 0.535667
N  2.30007 1.319135 0.428018
C  -0.848392 -0.667217 -0.202239
C  -2.337216 -0.455192 -0.367795
C  0.051035 0.371284 0.112265
C  -0.325756 -1.946548 -0.526629
C  1.446741 0.141841 0.116117
C  1.059131 -2.188477 -0.487607
C  1.959946 -1.14745 -0.169545
C  -4.424682 0.683389 0.264951
C  -2.502529 0.794194 1.849288
H  -0.293182 1.38477 0.333808
H  -1.019391 -2.739008 -0.822931
H  1.455367 -3.183482 -0.708188
H  -4.585138 1.773269 0.360187
H  -5.092458 0.162605 0.978358
H  -4.672747 0.355549 -0.755067
H  -1.572721 0.268656 2.109539
H  -3.255895 0.559931 2.625139
H  -2.314116 1.884955 1.87387
