program: Gaussian 09
title: 000220092
version: EM64L-G09RevD.01
frameworkgroup: C1[X(C10H15NO3)]
method: RPBEPBE
basis: SDD
operation: Freq
keyword: #p
keyword: freq=noraman
keyword: PBEPBE/SDD
title: #p freq=noraman PBEPBE/SDD
converged: YES YES NO NO
title: Mulliken charges:
elementType: O O O N C C C C C C C C C C H H H H H H H H H H H H H H H
charge: -0.211672 -0.410707 -0.235729 -0.012274 0.299514 -0.478712 -0.459916 -0.775964 0.166539 -0.503069 -0.459339 -0.792450 0.173113 -0.160503 0.247308 0.225896 0.235600 0.271345 0.234920 0.227444 0.219117 0.293848 0.259433 0.255029 0.257040 0.247448 0.260978 0.244174 0.381587
chargesum: 0.00000
title: Mulliken charges with hydrogens summed into heavy atoms:
elementType: O O O N C C C C C C C C C C
charge: -0.211672 -0.029120 -0.235729 -0.012274 0.299514 -0.005508 0.047029 -0.094483 0.166539 0.050212 0.052731 -0.039850 0.173113 -0.160503
polarizability: 1.26586429e+02 -9.24037835e+00 1.21763793e+02 6.44927583e+00 -1.00929027e+01 1.03641483e+02
1716.lowfreq: -14.6614 -10.4201 0.0006 0.0010 0.0011 4.9924 24.0818 29.5744 33.4924
frequency: 23.7265 29.2878 33.3977 46.1152 81.0849 97.2536 118.8991 136.6536 147.7911 191.8493 225.8778 251.0950 261.3774 295.7549 303.0275 342.2760 367.0056 400.0751 436.4299 467.8667 513.9247 534.7645 551.4583 578.3731 609.3668 649.2321 689.0241 749.9753 788.6097 831.5054 880.2810 926.8554 936.1233 951.5450 967.4237 989.0835 1030.7041 1036.5781 1049.4542 1079.3510 1100.7542 1121.0856 1164.0532 1171.1759 1215.3082 1234.5305 1250.0005 1274.6764 1291.6709 1293.0593 1315.2503 1350.6504 1367.4255 1371.8821 1396.0591 1438.1507 1445.8677 1449.1565 1452.9099 1474.1086 1477.3016 1481.0871 1494.6076 1608.1761 1662.3208 2199.6984 2983.0832 2985.7272 2987.3075 2992.7278 2995.2978 3013.4616 3040.0586 3045.7986 3065.3706 3070.4340 3073.0637 3084.3212 3087.9838 3122.9449 3511.6999
redmass: 9.4174 4.7954 8.3804 3.8343 2.9322 5.2410 1.9961 2.3904 1.4540 4.1795 1.8359 2.0071 2.4979 2.7064 3.9492 2.6194 3.7154 2.7486 3.5949 3.4515 2.2410 3.5815 3.9265 3.1098 2.7647 1.3999 2.6027 1.2714 1.7743 2.7455 3.9438 2.1953 3.4569 1.9924 1.6209 1.6340 2.0214 3.0149 2.6975 2.3098 2.1176 1.9048 1.5243 2.9462 1.3949 1.9251 1.5160 1.3236 1.4009 1.1727 1.5773 1.4212 1.2715 1.6963 1.2066 1.0763 1.0813 1.0724 1.0622 1.0681 1.0775 1.0673 1.0543 8.4501 8.1721 12.4321 1.0375 1.0555 1.0450 1.0598 1.0608 1.0645 1.0972 1.0981 1.0970 1.0963 1.0981 1.0993 1.0990 1.1001 1.0639
irintensity: 2.6778 6.6630 1.2955 4.6208 1.3501 1.8801 0.5041 3.0210 0.2213 3.5255 2.1160 1.3017 3.1354 1.9470 3.3599 0.6167 1.0816 0.7840 10.9807 10.3414 26.0400 16.9581 17.7873 16.1009 7.5830 115.9107 17.4627 6.3250 15.6946 6.3550 1.8121 15.4826 9.8592 3.0401 3.1040 1.1689 61.8657 28.8341 101.2183 87.7506 12.6603 0.9379 45.6618 34.4126 1.4519 27.2457 6.0837 7.0285 17.8510 2.1733 35.0455 2.4771 48.3492 50.3766 34.1427 27.7468 21.4659 9.9464 10.0842 27.5500 6.0264 6.8400 22.4684 86.9614 208.2039 14.9703 16.9837 5.9765 7.8899 4.7310 22.5768 13.0175 6.4233 5.3789 10.3382 15.4345 37.9143 17.3514 32.4438 10.5043 25.9215
temp: 298.150 k
press: 1.00000 atm
elementType: 8 8 8 7 6 6 6 6 6 6 6 6 6 6 1 1 1 1 1 1 1 1 1 1 1 1 1 1 1
symmnumber: 1
zpe: 614645.6 jmol-1
zpe.correction: 0.234106 hartree
zpe.thermalcorrener: 0.250475 hartree
zpe.thermalcorrenthalpy: 0.251419 hartree
zpe.thermalcorrgfe: 0.187801 hartree
zpe.sumelectzpe: -669.388476 hartree
zpe.sumelectthermal: -669.372108 hartree
zpe.sumelectthermalent: -669.371163 hartree
zpe.sumelectthermalfe: -669.434781 hartree
dipole: -2.5478 2.5868 -3.4375
dipole: 4.9998
quadrupole: -102.1606 -82.4523 -91.5577
quadrupole: 16.7491 -11.5512 -0.6802
quadrupole: -10.1038 9.6046 0.4992 16.7491 -11.5512 -0.6802
hfenergy: -669.6225822 hartree
pointgroup: C01 [X(C10H15N1O3)]
dipole: -1.1263928 -0.8247003 1.3858416 debye
polarizability: 128.2896073|8.7524059|118.7152037|-6.6902961|-10.8002544|104.9868945 unknown
InChI: InChI=1S/C10H15NO3/c1-8(12)10(2,5-3-7-11)6-4-9(13)14/h13H,3-6H2,1-2H3
charge 0 multiplicity 1
29 atoms
O  -0.055503 -1.917561 -1.794386
O  -2.95091 2.484828 -1.063645
O  -3.587539 1.011559 0.612723
N  4.149327 2.059738 -0.553237
C  0.308549 -1.029372 0.465767
C  -0.888185 -0.05379 0.765235
C  1.515956 -0.293882 -0.192145
C  0.731236 -1.711695 1.793346
C  -0.23176 -2.077353 -0.555323
C  -1.347845 0.804901 -0.432378
C  2.091694 0.872685 0.658327
C  -1.02398 -3.271306 -0.037251
C  -2.723451 1.402989 -0.203397
C  3.228172 1.532234 -0.008039
H  -1.753929 -0.633557 1.136612
H  -0.596314 0.607337 1.60459
H  2.320195 -1.03004 -0.379664
H  1.21659 0.082697 -1.184395
H  -0.106309 -2.259278 2.258902
H  1.562777 -2.422709 1.634698
H  1.066388 -0.958482 2.529537
H  -1.40579 0.195949 -1.357205
H  -0.647352 1.626728 -0.662568
H  1.316112 1.638037 0.852293
H  2.438046 0.509952 1.644421
H  -0.355202 -3.974117 0.494645
H  -1.486506 -3.796525 -0.88688
H  -1.806425 -2.965307 0.680805
H  -3.873843 2.831738 -0.921784
