program: Gaussian 09
title: 000220057
version: EM64L-G09RevD.01
frameworkgroup: C1[X(C7H12O4)]
method: RPBEPBE
basis: SDD
operation: Freq
keyword: #pfreq=noraman
keyword: PBEPBE/SDD
title: #p freq=noraman PBEPBE/SDD
converged: YES YES NO NO
title: Mulliken charges:
elementType: O O O O C C C C C C C H H H H H H H H H H H H
charge: -0.235641 -0.447845 -0.254289 -0.277899 -0.385340 -0.280046 -0.313675 0.315832 -0.316432 -0.096916 -0.546356 0.237564 0.237329 0.225056 0.225299 0.188174 0.188336 0.247335 0.247633 0.345237 0.252681 0.226260 0.217701
chargesum: 0.00000
title: Mulliken charges with hydrogens summed into heavy atoms:
elementType: O O O O C C C C C C C
charge: -0.235641 -0.102608 -0.254289 -0.277899 0.089553 0.170309 0.062836 0.315832 0.178536 0.155765 -0.102395
polarizability: 1.39161545e+02 -9.93542057e-01 7.82579012e+01 -2.02901948e-01 -1.47675367e-01 5.55463896e+01
1716.lowfreq: -103.3445 -15.0950 -3.7203 -0.0793 -0.0010 -0.0007 0.0005 27.1531 28.2120
frequency: -103.3418 27.1443 27.7569 56.4611 63.0905 102.7359 119.4437 138.7091 176.4530 236.6092 254.0720 289.7424 319.6026 399.2785 444.3756 542.9766 557.9263 676.7824 699.5645 790.9103 876.0233 876.6366 878.9133 935.1039 943.1216 978.1446 987.1191 1003.5730 1025.4233 1056.0918 1088.9178 1127.5791 1137.8654 1181.8773 1187.8924 1190.0314 1219.8829 1266.9768 1278.6119 1278.7981 1302.0174 1329.4196 1386.8565 1423.2870 1429.1438 1462.1002 1471.8887 1480.0559 1492.3763 1619.3877 1663.8361 2928.2035 2974.6158 2995.8194 2999.7790 3026.2561 3054.4646 3058.5644 3095.5604 3097.3142 3133.1517 3206.5125 3568.7394
redmass: 1.9114 5.6112 2.3649 5.3008 2.4514 2.8856 2.4489 4.4940 4.7939 6.7622 4.0978 1.0812 4.6679 3.8856 4.0923 1.3508 4.6885 10.1707 11.6539 1.0750 2.8343 1.4186 4.8034 1.3082 2.7689 1.2519 5.9400 1.4088 2.5702 8.4762 2.8718 1.5468 2.1457 1.1411 1.0863 4.7257 1.2644 1.1554 1.2706 1.1173 1.3110 1.3605 1.4723 1.4616 1.2075 1.0777 1.0790 1.0787 1.0853 10.4681 4.9811 1.0544 1.1073 1.0569 1.0574 1.0591 1.1062 1.1070 1.0615 1.1060 1.0942 1.1139 1.0665
irintensity: 2.7616 0.0050 3.5971 1.3386 11.5652 5.7992 1.0971 4.4143 0.0840 0.4549 0.4421 167.7057 15.5949 4.9152 44.1788 20.1868 0.3094 9.8786 18.7562 3.1551 25.6191 10.1541 22.9927 71.5579 105.5468 21.3909 38.2293 15.1459 10.1512 8.9108 43.8684 2.9341 2.0890 1.8090 17.4233 1008.6596 33.0078 0.1690 8.9498 1.1674 36.2787 23.6147 3.4240 5.5266 7.8874 15.6547 1.3139 7.1698 9.0282 238.5746 9.1049 70.5448 62.1530 11.0001 23.6883 17.8916 16.9554 11.1338 8.2422 46.0220 1.9852 20.0337 3.4498
temp: 298.150 k
press: 1.00000 atm
elementType: 8 8 8 8 6 6 6 6 6 6 6 1 1 1 1 1 1 1 1 1 1 1 1
symmnumber: 1
zpe: 482343.7 jmol-1
zpe.correction: 0.183715 hartree
zpe.thermalcorrener: 0.196414 hartree
zpe.thermalcorrenthalpy: 0.197358 hartree
zpe.thermalcorrgfe: 0.141907 hartree
zpe.sumelectzpe: -573.907863 hartree
zpe.sumelectthermal: -573.895163 hartree
zpe.sumelectthermalent: -573.894219 hartree
zpe.sumelectthermalfe: -573.949671 hartree
dipole: -0.7999 1.7485 0.0010
dipole: 1.9228
quadrupole: -42.8842 -72.8676 -65.8963
quadrupole: -9.7932 -0.0741 -0.0381
quadrupole: 17.6652 -12.3182 -5.3469 -9.7932 -0.0741 -0.0381
hfenergy: -574.0915776 hartree
pointgroup: C01 [X(C7H12O4)]
dipole: -0.3126235 -0.6804167 0.1074567 debye
dipolederiv: -1.9106468 0.1654078 -0.0659509 0.3962353 -0.4736733 0.0432023 -0.1058488 0.0377759 -0.2877729 -0.6608806 0.3288505 -0.0552599 0.3719798 -0.3959993 -0.0267224 -0.0617585 -0.0274802 -0.5891159 -1.7590853 -0.2905929 0.0155406 -0.5360671 -0.5518755 0.031708 0.0583491 0.0383847 -0.2960215 -0.8044412 0.0123972 -0.013293 0.0170992 -0.9552646 0.1086659 -0.014043 0.1088057 -0.3462039 -0.1832334 0.0054458 -0.0055641 -0.0449248 0.0332693 0.0090012 0.0035515 0.0103395 0.099761 1.0190883 0.0171324 0.0125941 0.1958523 0.2481175 0.0267271 -0.0200835 0.022398 0.368095 0.6438365 -0.2316676 0.0408041 -0.1475714 0.3965971 0.0083685 0.0266519 0.0070233 0.4569933 2.6660585 0.0563606 0.045124 0.0407229 1.442513 -0.1896565 0.0500045 -0.1902933 0.3702463 0.9831013 0.0583082 0.0043956 -0.2652793 0.1326477 0.0424377 0.0599757 0.0497137 0.397385 0.138256 0.0440001 0.0004728 0.1892096 0.1428328 -0.0592289 -0.0258199 -0.0629386 -0.1956192 -0.2183913 -0.0466763 0.0135878 -0.0571643 0.0900031 -0.0954381 0.0158773 -0.0950023 -0.4037503 0.0842581 -0.0084767 0.0254234 -0.0056274 0.0399306 0.0787658 0.0193402 0.0851518 -0.0703613 0.0856558 -0.0130056 -0.0182213 -0.0088319 -0.01962 -0.0958574 -0.0139267 -0.1021943 -0.0118252 -0.0407354 0.0032432 0.0083783 -0.0663506 -0.0370619 -0.0897305 -0.0005638 -0.1084374 -0.0334441 -0.0381073 -0.00324 -0.0087494 -0.0658435 0.0213878 0.0681297 0.0226517 0.0893175 -0.09007 -0.0097059 0.0276342 -0.0182851 0.0277192 -0.1472353 -0.1191968 -0.0232706 -0.1581368 -0.0792998 -0.0108443 0.0279236 0.0124705 0.0305888 -0.0565604 0.1125785 0.0171492 0.1514213 -0.1685368 -0.0846826 -0.0326692 0.0114516 0.0420155 0.0510176 0.0685572 -0.0092929 0.0723172 -0.0626192 -0.0833656 -0.0316618 -0.0029764 0.0463044 -0.0084028 -0.0860921 -0.0087199 -0.0930709 -0.0023748 0.0694997 -0.1100712 0.0132695 -0.1574689 0.19021 0.0320843 0.021063 0.0328087 0.3956297 0.0631321 0.0614061 -0.0142212 0.0133942 -0.0364725 0.0412307 -0.0056579 0.0422996 0.1777672 -0.0209473 -0.0882679 0.0108664 -0.0993199 -0.0231333 0.0377261 0.0127399 0.037906 0.1887907 0.0721806 0.0482193 -0.0118574 0.0833279 -0.0832276 0.0527395 -0.0183685 0.051891 0.1823465 unknown
polarizability: 139.1157787|1.4589586|77.6044304|1.6088109|-3.8134411|56.245627 unknown
InChI: InChI=1S/C7H12O4/c1-2-5-10-7(9)11-6-3-4-8/h2,8H,1,3-6H2
charge 0 multiplicity 1
23 atoms
O  -0.593804 0.257403 -0.023135
O  -5.368611 0.856415 -0.192835
O  1.631822 0.374835 0.009864
O  0.622967 -1.720236 0.348337
C  -2.99892 0.476628 -0.096546
C  -1.860447 -0.527697 0.08039
C  -4.36913 -0.206159 -0.005361
C  0.558611 -0.486831 0.133658
C  2.969445 -0.271193 0.156476
C  3.989576 0.829817 -0.020374
C  5.33027 0.648658 0.046205
H  -2.909781 0.975695 -1.077599
H  -2.933062 1.257806 0.681207
H  -1.855508 -1.306983 -0.704597
H  -1.884558 -1.027757 1.066758
H  -4.465857 -0.98546 -0.793401
H  -4.49156 -0.69572 0.986091
H  3.023687 -0.747799 1.153037
H  3.062319 -1.067097 -0.605844
H  -6.278181 0.468268 -0.142254
H  3.567258 1.824125 -0.213298
H  6.019064 1.487975 -0.090894
H  5.781198 -0.332892 0.237917
