program: Gaussian 09
title: 000220055
version: EM64L-G09RevD.01
frameworkgroup: C1[X(C10H9NO2)]
method: RPBEPBE
basis: SDD
operation: Freq
keyword: #p
keyword: freq=noraman
keyword: PBEPBE/SDD
title: #p freq=noraman PBEPBE/SDD
converged: YES YES NO NO
title: Mulliken charges:
elementType: O O N C C C C C C C C C C H H H H H H H H H
charge: -0.387791 -0.215697 -0.009381 -0.617766 -0.197840 0.484423 -0.415289 -0.369316 0.177268 -0.223241 -0.228496 -0.236350 -0.125017 0.262375 0.243939 0.303745 0.233780 0.240879 0.227454 0.230558 0.231179 0.390583
chargesum: 0.00000
title: Mulliken charges with hydrogens summed into heavy atoms:
elementType: O O N C C C C C C C C C C
charge: 0.002792 -0.215697 -0.009381 -0.111453 0.105905 0.484423 -0.181509 -0.128437 0.177268 0.004213 0.002062 -0.005171 -0.125017
polarizability: 1.40937976e+02 5.81829937e+00 1.18261977e+02 -1.00646951e+01 8.18210415e+00 7.14130501e+01
1716.lowfreq: -0.0007 -0.0006 -0.0002 1.9226 6.4187 8.3441 9.9659 26.8319 50.1292
frequency: 9.5002 26.7423 50.0824 74.4287 144.2635 185.4973 216.1770 255.7072 338.8331 380.9076 403.1371 468.0831 480.4154 497.5315 559.5496 584.5601 617.7663 621.9922 675.9621 706.0696 758.6347 798.3747 834.6571 854.7865 899.9074 928.6531 977.8289 988.0632 991.6343 997.9647 1027.4976 1038.5370 1076.1034 1088.9907 1158.3570 1174.2629 1190.8596 1219.4588 1234.1904 1279.4214 1302.4046 1325.6775 1332.8595 1383.3905 1442.0795 1478.0350 1486.1027 1594.1542 1615.6885 1659.5450 2204.7653 2974.8531 3018.4414 3082.1414 3113.8048 3125.8103 3136.2146 3148.5508 3165.4964 3513.0002
redmass: 10.1158 5.0467 4.5774 5.5635 8.5663 6.1059 6.3604 5.2125 2.2881 6.8369 2.8211 4.9430 4.5365 4.2345 5.5565 2.6709 6.1730 1.8406 2.7765 1.7845 1.8737 4.9692 2.8191 1.2519 2.5566 1.6764 1.3993 3.0806 4.4062 1.3222 2.2237 3.0227 2.2234 1.7226 1.2176 1.0527 1.1259 2.4230 1.1853 1.5357 1.9993 1.4937 1.2880 7.6742 2.1686 1.1548 2.1134 6.0217 6.1273 10.0858 12.5447 1.0800 1.0603 1.1036 1.0880 1.0863 1.0913 1.0960 1.1015 1.0641
irintensity: 3.0583 0.6376 0.6095 0.3945 3.9512 1.6443 1.7306 0.5765 0.1746 9.0748 0.0097 2.1684 4.0860 23.0005 32.0312 62.7708 0.4926 83.4597 60.9289 51.5848 48.9772 3.0916 0.8823 0.0368 3.2632 0.5155 0.0564 7.2724 1.5202 0.0523 3.0545 98.0535 109.1697 58.0660 14.6875 0.2238 0.2246 1.7620 14.9062 26.5428 31.2344 7.6160 1.1446 0.0098 8.3974 15.7562 10.9342 1.9657 3.9822 249.1110 4.9663 2.4308 10.3341 6.2313 8.4674 2.1398 12.7264 35.0165 18.8031 36.2527
temp: 298.150 k
press: 1.00000 atm
elementType: 8 8 7 6 6 6 6 6 6 6 6 6 6 1 1 1 1 1 1 1 1 1
symmnumber: 1
zpe: 436148.9 jmol-1
zpe.correction: 0.166120 hartree
zpe.thermalcorrener: 0.178078 hartree
zpe.thermalcorrenthalpy: 0.179022 hartree
zpe.thermalcorrgfe: 0.124609 hartree
zpe.sumelectzpe: -590.721731 hartree
zpe.sumelectthermal: -590.709773 hartree
zpe.sumelectthermalent: -590.708829 hartree
zpe.sumelectthermalfe: -590.763242 hartree
dipole: 0.1282 -2.4118 -0.5149
dipole: 2.4694
quadrupole: -60.5953 -87.2669 -75.2662
quadrupole: 2.9472 0.0908 7.3273
quadrupole: 13.7808 -12.8907 -0.8901 2.9472 0.0908 7.3273
hfenergy: -590.8878513 hartree
pointgroup: C01 [X(C10H9N1O2)]
dipole: 0.1451062 0.9565408 -0.0888209 debye
dipolederiv: -1.0331452 -0.2177949 0.400475 -0.2301395 -0.3977314 0.0718067 0.3888983 0.0832942 -0.580821 -0.680838 0.2264848 -0.0936337 0.0136371 -0.6773848 0.3607198 0.0977349 0.3198183 -0.6356003 -0.2197424 -0.0119939 -0.0006155 0.0048957 -0.2425536 0.0446055 -0.0034 -0.005714 -0.2253331 0.1900719 0.0464944 -0.0420651 0.0493869 0.0228047 0.0531475 -0.0601176 0.0135257 0.1608174 -0.2534403 0.1084573 -0.0162015 0.1123331 0.0831941 0.0973445 -0.1347602 0.1354502 0.108225 0.2594259 -0.0004948 0.0447885 -0.0610473 -0.0153637 -0.0023011 0.0749726 0.0126099 -0.092838 -0.1442494 -0.0523907 0.0323943 -0.0401595 0.0551258 0.0066154 0.0232865 0.0021348 -0.1492758 -0.1030137 0.0812069 0.0414941 0.0995922 0.0120851 0.0441331 0.0179589 0.0168618 -0.1132894 1.5300834 -0.1929781 -0.1809521 -0.0465053 0.7739823 -0.5825076 -0.2005161 -0.5690138 0.865067 -0.0160739 0.0720258 0.0553719 0.0915751 0.0641275 0.048769 0.0552517 0.049626 -0.117296 -0.0363486 -0.0732308 0.0300823 -0.0870966 0.1110733 0.017508 0.0354892 0.0063402 -0.1268622 0.0592044 -0.0322202 0.08327 -0.0344721 -0.0713011 -0.0002994 0.0717253 0.00344 -0.1342372 -0.0675965 0.0020554 -0.0025862 0.0119945 0.1530359 -0.0755565 0.0429493 -0.0393412 -0.0345038 0.0775349 -0.0280974 0.0015936 0.0130541 -0.0418842 0.063617 0.014867 0.0385838 0.0608764 0.000868 -0.0158864 -0.0336903 -0.0556707 0.0131637 -0.1143534 -0.0237623 -0.0606864 -0.0034845 0.1340416 -0.0215486 -0.0323305 0.0147345 0.0083192 -0.0164159 -0.0400511 -0.016261 0.0362216 0.0603748 0.1012455 -0.0267556 0.0878501 -0.069795 -0.0065111 -0.0279346 0.0068387 0.1336338 0.0324694 -0.0874508 -0.0599614 -0.0871421 -0.0048126 -0.0384296 -0.0621235 -0.0369556 0.1153719 0.0134696 -0.0852072 -0.053661 -0.0977763 -0.0413231 -0.0557652 -0.0627165 -0.05349 0.1315896 0.0503409 0.0690962 -0.017622 0.0916785 -0.0819218 -0.0115221 -0.0269146 -0.0101935 0.1468582 -0.1043155 0.0304635 -0.0789217 0.0321094 0.0856506 -0.0002437 -0.0846799 -0.0005088 0.1347886 0.2508786 0.0817638 -0.0504732 0.117168 0.2615091 0.0956391 -0.0961575 0.1036408 0.320092 unknown
polarizability: 140.4607942|-4.813911|119.5177251|9.7766238|-7.5154241|70.6344836 unknown
InChI: InChI=1S/C10H9NO2/c11-7-9(10(12)13)6-8-4-2-1-3-5-8/h1-5,9,12H,6H2
charge 0 multiplicity 1
22 atoms
O  -3.746639 0.444712 0.679857
O  -2.896934 1.876875 -0.938339
N  -1.508052 -2.163307 1.111617
C  -0.351942 0.489572 -0.934042
C  -1.355338 0.359881 0.265253
C  1.091724 0.262378 -0.512316
C  1.890608 1.356399 -0.08932
C  1.659243 -1.037542 -0.509729
C  -2.721852 0.975184 -0.094558
C  3.2248 1.157598 0.330899
C  2.993188 -1.239619 -0.090042
C  3.779682 -0.143306 0.332678
C  -1.4668 -1.028543 0.748499
H  -0.488166 1.504776 -1.345877
H  -0.655728 -0.225593 -1.719096
H  -0.962468 0.97478 1.103234
H  1.469721 2.370209 -0.101469
H  1.055764 -1.89406 -0.833207
H  3.830936 2.013199 0.649134
H  3.417077 -2.249856 -0.093006
H  4.814704 -0.300147 0.65611
H  -4.611428 0.882214 0.449318
