program: Gaussian 09
title: 000220046
version: EM64L-G09RevD.01
frameworkgroup: C1[X(C11H14O3)]
method: RPBEPBE
basis: SDD
operation: Freq
keyword: #pfreq=noraman
keyword: PBEPBE/SDD
title: #p freq=noraman PBEPBE/SDD
converged: YES YES NO NO
title: Mulliken charges:
elementType: O O O C C C C C C C C C C C H H H H H H H H H H H H H H
charge: -0.272349 -0.418932 -0.200022 0.126569 0.415776 0.277584 0.497743 -0.685373 -0.532326 -0.807902 -0.818219 -0.822446 -0.393489 0.191010 0.235629 0.231097 0.217614 0.269955 0.223312 0.224711 0.227277 0.228921 0.232557 0.223598 0.224931 0.274440 0.245422 0.382912
chargesum: 0.00000
title: Mulliken charges with hydrogens summed into heavy atoms:
elementType: O O O C C C C C C C C C C C
charge: -0.272349 -0.036020 -0.200022 0.126569 0.415776 0.277584 0.497743 -0.449745 -0.301229 -0.097020 -0.137310 -0.141360 0.126372 0.191010
polarizability: 1.59740041e+02 7.00662381e+00 1.42231899e+02 -1.17606938e+01 3.34780091e-01 8.56812666e+01
1716.lowfreq: -10.1612 -5.4290 0.0003 0.0005 0.0010 4.9110 26.3902 32.1040 38.9936
frequency: 26.3693 32.0175 38.8568 56.9926 62.2950 112.6397 135.3571 170.9407 203.7878 218.7956 265.8241 266.7428 299.2355 325.5057 331.6117 447.5693 453.8698 483.2079 526.5597 531.3760 538.3731 576.2192 587.2296 626.2851 632.1692 728.0026 747.8566 825.7761 845.5506 872.2628 883.4573 957.8513 992.6968 996.0397 1015.3722 1024.6548 1028.9723 1037.0710 1047.4906 1054.5243 1111.9358 1145.8974 1219.5766 1229.9559 1245.2296 1260.4900 1304.8391 1356.7299 1376.0060 1392.3698 1397.0197 1402.1882 1414.8951 1445.3243 1456.2362 1463.7702 1471.6864 1474.3253 1481.1917 1486.1132 1499.3897 1590.9851 1623.9505 1692.9052 2970.4805 2973.7432 2974.8301 2997.5603 3040.3584 3045.1758 3051.2208 3071.0325 3083.2568 3084.8718 3121.9088 3122.2443 3136.3148 3518.0158
redmass: 7.3004 3.1675 1.2169 2.3908 1.3819 3.1234 1.1110 3.1498 2.9843 3.2910 2.8385 6.6514 2.7825 3.1701 3.4388 4.4215 4.0491 2.0017 4.7995 3.7586 3.0187 3.8511 3.8341 4.5975 1.5119 2.5937 4.0179 4.6275 1.4900 1.3221 3.0938 3.4145 1.7719 2.2399 1.5823 1.4269 2.1488 2.0343 1.5495 1.6231 3.7425 2.7796 1.8617 1.2036 1.5934 1.4860 5.1240 1.5377 4.5447 1.3419 1.2406 1.2320 2.4530 1.0932 1.2257 1.0478 1.0513 1.1941 1.1426 1.0467 2.5010 6.3529 6.5783 9.0105 1.0376 1.0375 1.0402 1.0619 1.0970 1.0968 1.0974 1.0988 1.0985 1.0983 1.0942 1.0922 1.0906 1.0643
irintensity: 0.8357 0.8694 1.3057 0.5190 0.1727 1.0141 1.8871 2.0541 2.2872 1.1537 1.6383 0.6641 0.6359 1.2697 0.5654 2.6665 17.8974 30.8473 0.2673 16.5303 1.6761 8.8345 8.9078 25.3774 131.7807 1.8992 1.7640 6.2578 30.1191 1.9785 9.7846 7.6178 65.4548 104.7109 4.3768 6.8054 126.2755 143.8478 15.2304 0.7446 98.4213 22.5249 2.3123 11.1212 33.7480 1.2329 55.4759 14.1547 8.5935 4.9015 8.5562 20.6703 11.7504 38.2787 3.9543 4.2878 14.2666 7.2943 33.0203 26.4806 46.9209 72.5823 24.1110 186.6460 56.7010 39.1311 20.6383 30.5687 44.2246 0.8447 22.9880 7.8020 17.1576 24.9031 0.0143 30.9101 14.6274 26.8265
temp: 298.150 k
press: 1.00000 atm
elementType: 8 8 8 6 6 6 6 6 6 6 6 6 6 6 1 1 1 1 1 1 1 1 1 1 1 1 1 1
symmnumber: 1
zpe: 590604.9 jmol-1
zpe.correction: 0.224950 hartree
zpe.thermalcorrener: 0.240197 hartree
zpe.thermalcorrenthalpy: 0.241141 hartree
zpe.thermalcorrgfe: 0.180385 hartree
zpe.sumelectzpe: -652.189626 hartree
zpe.sumelectthermal: -652.174378 hartree
zpe.sumelectthermalent: -652.173434 hartree
zpe.sumelectthermalfe: -652.234190 hartree
dipole: 0.9760 1.1219 -1.1679
dipole: 1.8908
quadrupole: -67.3938 -78.0258 -88.2271
quadrupole: 3.2128 -2.1024 2.2685
quadrupole: 10.4885 -0.1436 -10.3449 3.2128 -2.1024 2.2685
hfenergy: -652.4145752 hartree
pointgroup: C01 [X(C11H14O3)]
dipole: 0.1687605 0.6464676 -0.3270732 debye
polarizability: 151.4593959|13.5005103|148.9384992|-9.2830634|9.7498241|87.2553113 unknown
InChI: InChI=1S/C11H14O3/c1-7-4-8(2)9(3)10(5-7)14-6-11(12)13/h4-5,12H,6H2,1-3H3
charge 0 multiplicity 1
28 atoms
O  1.377236 -0.578023 -0.588763
O  3.612665 2.122801 0.533174
O  2.60537 0.461047 1.821472
C  -0.850445 -1.383407 -0.222098
C  -2.215002 -1.140063 0.097511
C  0.033237 -0.269441 -0.242126
C  -1.766996 1.276816 0.362436
C  -2.654965 0.178486 0.380738
C  -0.406965 1.041023 0.043218
C  -0.34948 -2.782765 -0.527343
C  -3.203837 -2.291824 0.137288
C  -2.243277 2.681434 0.693769
C  2.336488 0.498661 -0.662635
C  2.817696 0.976779 0.711208
H  -3.710786 0.346853 0.624997
H  0.286138 1.889567 0.0380
H  -0.888054 -3.222388 -1.388999
H  0.725454 -2.77567 -0.757608
H  -0.513318 -3.460403 0.332634
H  -3.264648 -2.811902 -0.838196
H  -2.908716 -3.054116 0.883837
H  -4.216221 -1.938687 0.396375
H  -1.823708 3.030154 1.657059
H  -1.933431 3.408967 -0.079523
H  -3.342937 2.723335 0.775238
H  3.208205 0.081728 -1.197031
H  1.967079 1.36554 -1.243686
H  3.979018 2.4145 1.411656
