program: Gaussian 09
title: 000220044
version: EM64L-G09RevD.01
frameworkgroup: C1[X(C13H20O2)]
method: RPBEPBE
basis: SDD
operation: Freq
keyword: #pfreq=noraman
keyword: PBEPBE/SDD
title: #p freq=noraman PBEPBE/SDD
converged: YES YES NO NO
title: Mulliken charges:
elementType: O O C C C C C C C C C C C C C H H H H H H H H H H H H H H H H H H H H
charge: -0.313474 -0.458096 -0.193968 0.356072 -0.365697 -0.721286 0.190100 -0.377747 -0.692272 -0.291077 -0.359919 -0.069167 -0.271168 -0.243517 -0.686043 0.233505 0.197958 0.198044 0.227399 0.212564 0.206254 0.231184 0.215490 0.196918 0.231392 0.219439 0.203286 0.245557 0.205046 0.224774 0.224875 0.244976 0.199582 0.222759 0.356258
chargesum: 0.00000
title: Mulliken charges with hydrogens summed into heavy atoms:
elementType: O O C C C C C C C C C C C C C
charge: -0.313474 -0.101837 0.039537 0.356072 0.030305 -0.075069 0.190100 -0.146562 -0.048472 0.131648 -0.114363 0.135879 -0.046395 -0.018642 -0.018727
polarizability: 1.76933032e+02 1.32684604e+00 1.58908066e+02 -2.50074976e+00 -8.52000330e+00 1.06065843e+02
1716.lowfreq: -2.4314 -0.0007 -0.0005 0.0002 7.4650 10.8158 27.3045 43.6213 51.5724
frequency: 26.5581 43.6065 51.4871 78.8946 82.3637 125.8560 140.3921 173.6158 186.0977 194.2783 214.0139 230.0821 241.1560 254.0981 290.7551 328.4199 376.6971 413.6451 437.1968 451.8044 476.8367 489.3395 519.3102 564.9251 565.5278 596.5173 714.0922 744.6632 754.8219 788.8992 804.7420 833.6832 848.6921 853.5800 914.1538 932.6530 944.3275 961.3925 973.5305 982.8913 996.6676 1026.6117 1040.5363 1050.4043 1079.0039 1087.3632 1105.3912 1106.9467 1152.1249 1155.3274 1174.9190 1188.1634 1215.2095 1220.5300 1244.7007 1246.9741 1286.5187 1302.0103 1314.6513 1334.1351 1338.2118 1352.0513 1385.2887 1387.2566 1388.8442 1393.7655 1398.3698 1437.5065 1453.8708 1461.1141 1464.8542 1472.5499 1477.1993 1477.9078 1480.3117 1482.5353 1485.5622 1593.2560 1604.8291 2956.6854 2963.6812 2968.4725 2972.4090 2975.3321 2993.9268 3011.1050 3028.9104 3034.6160 3063.6363 3069.3142 3078.1336 3079.3108 3092.0004 3104.6348 3121.7372 3134.4252 3153.9764 3168.3819 3528.5493
redmass: 3.2574 3.5745 4.4144 3.1439 3.4744 2.1741 2.8707 3.1668 1.5060 1.4589 1.0718 3.7046 1.8679 1.9593 2.9416 3.2824 2.9790 2.8089 3.1311 1.1501 2.5253 3.0730 4.2686 2.8745 3.5041 6.8190 3.0509 3.0340 1.3240 3.1248 1.5259 2.9309 1.7347 1.7360 1.8398 1.3977 1.4041 1.2476 1.3102 5.7374 1.6603 2.6451 2.1726 2.1297 1.7471 2.3032 2.5807 1.7301 2.0511 1.9866 1.0750 1.8722 1.2308 2.8423 1.1606 1.3197 1.4846 1.2716 1.3385 1.4065 1.5615 1.2835 1.3668 1.3245 1.2417 2.3570 1.6565 2.2033 1.1420 1.0791 1.0713 1.1024 1.0438 1.1133 1.0509 1.0637 1.8492 6.8025 6.3110 1.0823 1.0569 1.0558 1.0379 1.0375 1.0361 1.0918 1.0931 1.1079 1.0991 1.0985 1.1000 1.0996 1.0999 1.0996 1.0861 1.0888 1.0938 1.0990 1.0652
irintensity: 0.0582 2.0371 0.2790 0.1293 0.4127 0.0322 5.8268 0.3747 0.8880 1.4187 0.1653 1.3747 0.1490 0.3895 0.5418 0.6611 1.8709 22.5358 6.5426 132.7598 14.9211 5.0667 1.0103 1.3588 1.3196 5.2520 10.4824 0.9344 89.7702 9.0170 7.1068 21.2950 0.3075 0.7274 7.9048 2.8044 4.3034 5.4267 0.2400 77.9704 14.4092 2.7912 18.3951 51.5593 3.8651 33.3590 14.3098 5.7080 22.5951 13.6308 6.9513 36.5399 9.8027 157.9509 32.4071 9.8401 2.8185 2.7295 27.6440 3.8898 4.5914 0.1732 4.3844 2.2265 15.1299 35.4004 18.4287 34.7986 18.5156 23.3596 2.9881 2.0809 11.7727 14.5870 9.8914 15.9310 49.6802 9.4351 23.9467 32.7912 46.6820 31.4837 39.1304 39.8237 24.6158 7.4084 13.0726 37.3158 33.4551 73.4462 42.9490 53.8259 38.2098 23.8658 7.4145 11.4089 33.6166 16.4817 11.8567
temp: 298.150 k
press: 1.00000 atm
elementType: 8 8 6 6 6 6 6 6 6 6 6 6 6 6 6 1 1 1 1 1 1 1 1 1 1 1 1 1 1 1 1 1 1 1 1
symmnumber: 1
zpe: 789345.8 jmol-1
zpe.correction: 0.300646 hartree
zpe.thermalcorrener: 0.317368 hartree
zpe.thermalcorrenthalpy: 0.318312 hartree
zpe.thermalcorrgfe: 0.255698 hartree
zpe.sumelectzpe: -656.647338 hartree
zpe.sumelectthermal: -656.630615 hartree
zpe.sumelectthermalent: -656.629671 hartree
zpe.sumelectthermalfe: -656.692285 hartree
dipole: 0.4535 1.5229 0.9053
dipole: 1.8288
quadrupole: -89.5554 -87.9120 -95.4947
quadrupole: -8.1103 -5.5256 -2.7162
quadrupole: 1.4319 3.0754 -4.5073 -8.1103 -5.5256 -2.7162
hfenergy: -656.9479837 hartree
pointgroup: C01 [X(C13H20O2)]
dipole: -0.2517902 0.5755004 -0.3508492 debye
polarizability: 177.1017227|1.1307992|158.3427296|-0.033211|9.8484096|106.4624881 unknown
InChI: InChI=1S/C13H20O2/c1-4-10(2)12-7-5-6-8-13(12)15-9-11(3)14/h5-8,10-11,14H,4,9H2,1-3H3
charge 0 multiplicity 1
35 atoms
O  1.027478 0.190136 -0.154783
O  3.364885 -0.922693 0.922985
C  -1.104424 -1.646419 -0.59807
C  -1.347961 -0.193424 -0.177169
C  -1.51865 -2.645613 0.524265
C  -1.832785 -1.979247 -1.926952
C  -0.270118 0.714755 0.036509
C  -2.660222 0.298823 0.019081
C  -0.680983 -2.51343 1.813642
C  2.18786 1.067043 0.085874
C  -0.502227 2.059876 0.414921
C  3.417178 0.162584 -0.069806
C  -2.911275 1.635803 0.402958
C  -1.826279 2.516915 0.597355
C  4.72703 0.917629 0.169225
H  -0.019242 -1.771036 -0.768468
H  -1.422077 -3.675197 0.124043
H  -2.592335 -2.500995 0.761566
H  -1.533513 -1.283165 -2.730962
H  -1.589959 -3.008278 -2.251848
H  -2.931409 -1.913719 -1.815643
H  -3.506071 -0.381767 -0.135456
H  -1.014215 -3.233787 2.583048
H  0.389699 -2.711749 1.612208
H  -0.7629 -1.49746 2.240628
H  2.144806 1.476163 1.11558
H  2.199535 1.896935 -0.64972
H  0.331076 2.751601 0.568622
H  3.402229 -0.266698 -1.095384
H  -3.939656 1.984201 0.545538
H  -2.002464 3.557712 0.890867
H  5.574657 0.217232 0.086835
H  4.863743 1.724311 -0.57373
H  4.74326 1.353943 1.18368
H  2.458826 -1.327185 0.87036
