program: Gaussian 09
title: 000220041
version: EM64L-G09RevD.01
frameworkgroup: C1[X(C12H14O2)]
method: RPBEPBE
basis: SDD
operation: Freq
keyword: #pfreq=noraman
keyword: PBEPBE/SDD
title: #p freq=noraman PBEPBE/SDD
converged: YES YES NO NO
title: Mulliken charges:
elementType: O O C C C C C C C C C C C C H H H H H H H H H H H H H H
charge: -0.287143 -0.439828 0.247875 -0.398049 0.353688 0.272451 0.122211 -0.699005 -0.719922 -0.818889 -0.558646 -0.355165 0.273504 -0.352724 0.235031 0.213167 0.238746 0.229854 0.238094 0.200842 0.234074 0.226834 0.234393 0.231569 0.222805 0.252005 0.252824 0.349403
chargesum: 0.00000
title: Mulliken charges with hydrogens summed into heavy atoms:
elementType: O O C C C C C C C C C C C C
charge: -0.287143 -0.090424 0.247875 -0.163018 0.353688 0.272451 0.122211 -0.017239 -0.046911 -0.130122 -0.331813 -0.103160 0.273504 -0.099899
polarizability: 1.96551343e+02 3.42936674e+00 1.40706366e+02 -1.39161482e+00 3.42596520e+00 7.99772607e+01
1716.lowfreq: -14.7893 -2.4071 -0.0008 0.0003 0.0005 10.6482 50.7613 115.4482 133.5933
frequency: 50.7559 115.4471 133.5860 161.2966 195.9045 206.6398 215.5561 242.0136 275.0535 292.0294 318.5421 326.2059 359.1782 373.3675 405.5267 430.9508 451.8177 490.9887 507.2313 513.9907 518.1498 588.7906 631.8901 698.2360 727.7590 755.0119 808.2529 811.4209 823.8184 843.0114 889.9127 911.0526 921.0315 939.7705 941.2738 995.4954 1015.6174 1047.6697 1056.2548 1112.3915 1129.9372 1147.7487 1181.8552 1199.3467 1222.6521 1246.6868 1275.0666 1284.6874 1359.1452 1371.9666 1390.7870 1392.2616 1398.2984 1430.9795 1451.9532 1459.3022 1467.2555 1467.8164 1477.2041 1480.6801 1485.6041 1594.4076 1616.6821 1660.0202 2970.3434 2981.8140 2993.8207 3046.1864 3081.4011 3088.0202 3090.2561 3094.3877 3104.4929 3119.4149 3122.2116 3157.2092 3178.8450 3586.2053
redmass: 3.9320 3.1953 2.9945 4.7790 1.0309 2.4673 1.1986 1.1764 2.2998 2.8297 1.1164 3.7775 5.4095 3.3967 3.2730 4.0519 3.7613 3.1342 3.6089 3.7984 4.5665 4.1884 3.6521 5.9517 3.7845 4.3923 1.6031 2.7564 1.6213 1.6263 3.1472 3.0705 1.7315 1.8832 1.3521 1.3313 1.7686 1.5236 2.1408 1.4480 1.8054 1.5429 2.4922 2.6410 1.8931 2.6093 1.6534 2.8622 2.4428 1.2200 1.6001 3.1689 1.2782 3.3993 1.0519 1.0510 1.0487 1.0672 1.0949 1.2347 2.2057 6.6074 6.8724 7.6801 1.0378 1.0346 1.0354 1.0968 1.0995 1.0984 1.1009 1.0993 1.1007 1.0906 1.0914 1.0882 1.0972 1.0660
irintensity: 1.0631 0.2725 0.9322 0.9605 0.0282 1.3342 0.4117 0.5256 0.5799 0.6165 137.6606 3.4571 1.2723 7.1150 17.5478 4.1093 2.2416 8.1267 3.2624 4.2235 1.2780 1.5961 5.6558 8.8400 3.4517 2.4995 12.3857 26.1685 31.5929 47.0221 43.2792 19.0481 0.6457 2.9124 0.2761 0.9837 3.7372 5.4513 2.2960 111.9320 200.5765 47.4799 29.8199 67.8464 16.8786 22.6639 5.0830 39.3859 16.5659 29.7913 12.3045 22.8007 15.6787 116.0829 4.7890 2.3932 14.2984 11.8677 6.9195 25.5691 54.8540 13.1139 18.7508 15.1549 30.2411 17.0553 24.0736 20.5631 10.0045 23.1884 21.9079 27.3065 28.1158 16.3000 15.0756 3.7742 6.5774 33.2014
temp: 298.150 k
press: 1.00000 atm
elementType: 8 8 6 6 6 6 6 6 6 6 6 6 6 6 1 1 1 1 1 1 1 1 1 1 1 1 1 1
symmnumber: 1
zpe: 597593.6 jmol-1
zpe.correction: 0.227611 hartree
zpe.thermalcorrener: 0.241047 hartree
zpe.thermalcorrenthalpy: 0.241992 hartree
zpe.thermalcorrgfe: 0.188934 hartree
zpe.sumelectzpe: -615.081498 hartree
zpe.sumelectthermal: -615.068062 hartree
zpe.sumelectthermalent: -615.067118 hartree
zpe.sumelectthermalfe: -615.120175 hartree
dipole: 1.3659 2.8280 0.8867
dipole: 3.2633
quadrupole: -79.2619 -75.1796 -86.9422
quadrupole: -5.2778 0.3335 0.1859
quadrupole: 1.1993 5.2816 -6.4810 -5.2778 0.3335 0.1859
hfenergy: -615.3091093 hartree
pointgroup: C01 [X(C12H14O2)]
dipole: -0.5956134 1.0914382 -0.3200132 debye
polarizability: 195.6421415|-2.3675608|140.4144468|-11.0882925|-4.4066908|81.1783822 unknown
InChI: InChI=1S/C12H14O2/c1-8-7-12(2,3)14-11-5-4-9(13)6-10(8)11/h4-7,13H,1-3H3
charge 0 multiplicity 1
28 atoms
O  -1.222368 -1.229413 0.625297
O  4.089893 0.196754 -0.566794
C  -2.360724 -0.364217 0.13903
C  -1.987672 1.106688 0.259791
C  -0.699653 1.552583 0.161234
C  0.384372 0.554323 0.032713
C  0.075754 -0.816177 0.281231
C  -2.643087 -0.743868 -1.33525
C  -3.532773 -0.7427 1.05837
C  -0.357755 3.028301 0.210102
C  1.732106 0.899353 -0.253551
C  1.087866 -1.799375 0.274278
C  2.737497 -0.091069 -0.280766
C  2.420888 -1.442321 -0.008647
H  -2.816543 1.813702 0.388854
H  -3.48022 -0.141761 -1.733577
H  -1.75414 -0.552289 -1.961484
H  -2.907758 -1.813803 -1.409871
H  -3.303361 -0.481244 2.10502
H  -4.449955 -0.209433 0.749574
H  -3.721191 -1.828478 1.001592
H  1.991168 1.948035 -0.448039
H  0.350697 3.252205 1.030034
H  -1.263882 3.638514 0.362043
H  0.117565 3.362729 -0.732776
H  0.817157 -2.837203 0.489569
H  3.218481 -2.190305 -0.02729
H  4.212834 1.163269 -0.736285
