program: Gaussian 09
title: 000220042
version: EM64L-G09RevD.01
frameworkgroup: C1[X(C17H32O4)]
method: RPBEPBE
basis: SDD
operation: Freq
keyword: #pfreq=noraman
keyword: PBEPBE/SDD
title: #p freq=noraman PBEPBE/SDD
converged: YES YES NO NO
title: Mulliken charges:
elementType: O O O O C C C C C C C C C C C C C C C C C H H H H H H H H H H H H H H H H H H H H H H H H H H H H H H H H
charge: -0.279452 -0.275016 -0.228961 -0.208772 -0.059293 0.118966 -0.395493 -0.399029 -0.408137 -0.778603 0.191443 0.164312 -0.372598 -0.726136 -0.356550 -0.357323 -0.263681 -0.261709 -0.696716 -0.666889 -0.667135 0.221333 0.202454 0.201163 0.214891 0.223676 0.201770 0.191227 0.257078 0.209680 0.236891 0.188409 0.191838 0.226121 0.210555 0.244364 0.188497 0.189357 0.195571 0.194793 0.239687 0.220348 0.220644 0.233265 0.210237 0.215468 0.209808 0.249055 0.223722 0.217843 0.223878 0.256056 0.217094
chargesum: 0.00000
title: Mulliken charges with hydrogens summed into heavy atoms:
elementType: O O O O C C C C C C C C C C C C C C C C C
charge: -0.279452 -0.275016 -0.228961 -0.208772 0.162040 0.118966 0.008124 0.039538 -0.015140 -0.074954 0.191443 0.164312 0.007649 -0.045096 0.021304 0.033040 0.196354 0.192200 -0.061203 0.023730 0.029893
polarizability: 2.21158161e+02 -9.24181127e+00 2.03948001e+02 -2.30781750e-01 3.05605897e+00 1.69423433e+02
1716.lowfreq: -6.4497 -4.9501 -0.0004 0.0002 0.0007 4.3371 24.2260 29.4931 35.8476
frequency: 23.8833 29.2903 35.6621 38.3936 40.2948 62.7958 65.4778 77.1538 85.0148 89.6571 98.5960 110.2047 121.5028 127.1851 139.4877 151.6856 162.8359 184.3251 185.3310 203.5809 210.1532 211.7934 223.7537 232.0265 242.3591 264.1571 274.4275 310.9808 315.3747 328.4255 350.6453 374.6872 410.8022 419.6619 424.4445 448.4657 479.8566 523.7514 557.0586 650.5239 703.5709 720.2720 721.2559 733.3565 736.8602 764.2077 780.1325 800.1636 813.0231 817.2692 835.5768 858.6131 882.6762 896.3245 923.6230 943.4894 955.5149 967.5806 1000.9799 1012.9900 1016.1058 1022.4473 1028.4337 1054.4055 1058.6585 1067.5825 1079.6271 1086.0333 1092.2097 1095.2343 1096.8404 1120.9162 1132.1236 1153.8601 1154.7674 1167.0670 1168.8169 1187.3378 1203.3489 1229.9625 1247.2563 1269.4849 1278.2641 1280.6322 1280.9251 1284.4960 1288.0937 1292.7292 1313.2875 1322.9671 1335.4250 1345.7797 1353.2415 1353.9915 1354.8823 1359.2804 1389.4188 1390.3527 1390.9079 1393.8174 1397.5487 1449.5491 1454.3623 1455.4946 1459.8367 1461.1918 1462.2282 1465.2933 1466.2495 1473.0949 1476.8286 1477.2871 1478.6114 1481.2269 1482.6264 1484.6670 1485.9632 1487.7083 1490.5391 1613.1612 1646.1924 2949.5040 2953.4059 2959.9879 2966.4692 2970.1434 2971.6841 2985.9835 2987.0053 2992.2376 2992.3364 2992.9325 2993.9979 2999.7555 3008.6504 3015.0958 3026.4454 3029.3444 3030.5814 3046.2997 3066.5310 3068.4097 3070.4315 3082.0176 3082.7330 3086.1762 3086.3641 3091.7335 3093.0357 3096.8399 3100.2219 3117.2858 3118.5932
redmass: 3.4030 3.6743 3.0091 2.7219 2.2381 3.2016 2.8470 3.6391 2.0321 4.0554 2.9280 1.8715 3.1539 3.1414 2.2763 2.4553 2.6474 2.0246 1.7705 1.4971 1.3007 3.1250 2.1849 1.1137 1.6049 1.8538 3.7903 2.7008 2.6292 3.1239 3.4968 4.3688 3.7021 3.3595 2.6766 3.3146 2.7973 3.7565 4.4464 3.3969 5.2740 1.1166 3.2492 1.1513 2.6075 2.0391 1.2149 1.8219 1.3572 1.4548 3.3798 1.5055 1.8820 2.0078 2.2575 2.0994 1.2564 3.0546 2.9571 2.7679 2.7773 1.3721 2.6751 1.8814 2.8099 2.4537 2.1786 3.8113 2.2039 2.1671 2.1577 2.7074 4.0264 1.7601 1.6992 2.4839 2.4389 2.0052 1.6878 1.4017 1.3434 1.2515 1.1155 1.0393 1.1125 1.1925 1.3023 1.1217 1.4143 1.3112 1.3961 1.3206 1.6598 1.3134 1.4027 1.3426 1.2315 1.2173 1.2309 1.2040 1.2030 1.0819 1.0970 1.0931 1.0770 1.0719 1.0440 1.0559 1.0629 1.0759 1.0544 1.0433 1.0450 1.0776 1.0487 1.0513 1.0510 1.0801 1.0577 9.9126 10.0955 1.0590 1.0591 1.0609 1.0601 1.0615 1.0364 1.0964 1.0365 1.0362 1.0369 1.0445 1.0739 1.0969 1.0629 1.1000 1.0594 1.0593 1.1031 1.1027 1.0990 1.1007 1.0993 1.0982 1.0982 1.0975 1.0977 1.1032 1.1032 1.0996 1.1008 1.1056 1.1059
irintensity: 0.1267 0.1795 0.9254 0.7549 0.8112 1.1063 0.7238 0.1243 0.0214 0.2967 0.3761 0.0045 0.2541 0.5495 0.1268 0.7186 0.2059 0.8818 2.9589 1.6828 0.8943 1.3420 0.1825 0.0067 0.9586 1.1389 3.9421 6.5571 8.6411 1.0681 5.7915 3.1923 2.4434 2.0167 0.5690 5.4405 0.3220 9.4389 4.5062 1.7480 2.3986 12.4014 1.7078 0.7090 15.6960 7.4076 2.5851 9.0847 1.9962 5.5349 1.4923 0.0074 4.2842 1.7748 63.5717 7.3789 4.1012 5.4467 3.7946 16.1733 113.1305 10.5160 10.3264 10.0617 416.1069 44.8292 4.1736 2.7057 26.5440 9.1248 12.6033 24.8993 10.4149 7.3536 28.4454 22.7404 22.4007 78.6125 31.0986 19.5929 3.9459 0.4131 1.9431 0.5062 2.9656 0.6207 9.9158 0.7218 15.8090 3.0855 0.5790 5.1034 1.2131 0.8337 1.1507 1.3250 14.9723 12.0210 23.6013 24.3568 30.2931 4.5834 6.6000 16.2565 4.3342 0.0306 15.1134 10.2835 9.5432 0.9874 1.1557 12.5809 5.3526 3.5802 5.6129 18.3413 20.1175 9.5067 15.1022 71.1682 189.9806 0.5576 5.7408 3.4494 23.6546 124.7049 40.7465 0.6987 37.4574 20.3207 13.5297 19.5603 26.4795 2.6330 21.6711 1.7805 32.1356 30.8333 19.1344 113.7849 9.1103 92.5728 54.7339 37.1589 45.5277 44.1746 34.2072 2.6424 2.0706 12.8615 41.6486 30.1157 30.5124
temp: 298.150 k
press: 1.00000 atm
elementType: 8 8 8 8 6 6 6 6 6 6 6 6 6 6 6 6 6 6 6 6 6 1 1 1 1 1 1 1 1 1 1 1 1 1 1 1 1 1 1 1 1 1 1 1 1 1 1 1 1 1 1 1 1
symmnumber: 1
zpe: 1214664.8 jmol-1
zpe.correction: 0.462641 hartree
zpe.thermalcorrener: 0.489774 hartree
zpe.thermalcorrenthalpy: 0.490718 hartree
zpe.thermalcorrgfe: 0.403083 hartree
zpe.sumelectzpe: -966.191441 hartree
zpe.sumelectthermal: -966.164309 hartree
zpe.sumelectthermalent: -966.163365 hartree
zpe.sumelectthermalfe: -966.251000 hartree
dipole: -1.6780 -0.7507 1.8946
dipole: 2.6398
quadrupole: -134.3910 -115.0461 -133.8261
quadrupole: -11.1358 6.4061 1.2576
quadrupole: -6.6366 12.7083 -6.0717 -11.1358 6.4061 1.2576
hfenergy: -966.6540827 hartree
pointgroup: C01 [X(C17H32O4)]
dipole: -0.6464638 -0.3038815 0.753921 debye
polarizability: 221.2885516|-9.0487465|203.7708435|-1.0726679|3.3344703|169.4702006 unknown
InChI: InChI=1S/C17H32O4/c1-6-10-11-12-13-14(5)17(7-2,15(18)20-8-3)16(19)21-9-4/h14H,6-13H2,1-5H3
charge 0 multiplicity 1
53 atoms
O  0.879952 2.510925 0.456306
O  2.636276 -1.904634 0.49568
O  1.466554 1.598978 -1.597815
O  3.67995 -0.025586 -0.398862
C  0.090677 -0.787411 -0.136293
C  1.307345 0.106216 0.380342
C  -1.273941 -0.062075 0.041331
C  1.242765 0.254764 1.941906
C  -2.493246 -1.012981 -0.00053
C  0.27627 -1.274427 -1.593064
C  1.260398 1.45182 -0.372726
C  2.658238 -0.57099 0.0679
C  -3.83253 -0.271283 0.214223
C  2.483237 0.897926 2.598698
C  -5.061857 -1.207153 0.187098
C  -6.400245 -0.463484 0.400557
C  0.745901 3.848842 -0.20209
C  3.912313 -2.670582 0.340436
C  -7.623841 -1.404925 0.377105
C  -0.635945 4.013956 -0.841214
C  4.023311 -3.270069 -1.064103
H  0.099424 -1.6754 0.527379
H  -1.298478 0.479874 1.006406
H  -1.386637 0.705896 -0.752076
H  1.092105 -0.760922 2.354137
H  0.355232 0.857619 2.195822
H  -2.531354 -1.547193 -0.970621
H  -2.375853 -1.791878 0.782087
H  0.339314 -0.424217 -2.293548
H  -0.573607 -1.913432 -1.892009
H  1.195126 -1.875885 -1.703458
H  -3.802592 0.266229 1.185449
H  -3.948476 0.508206 -0.567972
H  3.394817 0.291721 2.447966
H  2.323021 0.994149 3.688034
H  2.669547 1.9059 2.191598
H  -4.947868 -1.986865 0.969285
H  -5.093812 -1.74464 -0.783855
H  -6.513935 0.3129 -0.383588
H  -6.365785 0.076607 1.36894
H  1.54925 3.94892 -0.952836
H  0.906033 4.557427 0.626393
H  3.842567 -3.446864 1.119426
H  4.75605 -1.989968 0.551465
H  -7.697665 -1.934489 -0.591608
H  -8.567153 -0.849088 0.530819
H  -7.549195 -2.170934 1.172041
H  -0.762165 3.316318 -1.685682
H  -1.436879 3.836405 -0.102584
H  -0.744307 5.044818 -1.226926
H  3.152367 -3.908962 -1.291847
H  4.094376 -2.474151 -1.824045
H  4.934855 -3.89283 -1.131079
