program: Gaussian 09
title: 000220013
version: EM64L-G09RevD.01
frameworkgroup: C1[X(C12H22O2)]
method: RPBEPBE
basis: SDD
operation: Freq
keyword: #pfreq=noraman
keyword: PBEPBE/SDD
title: #p freq=noraman PBEPBE/SDD
converged: YES YES NO NO
title: Mulliken charges:
elementType: O O C C C C C C C C C C C C H H H H H H H H H H H H H H H H H H H H H H
charge: -0.418098 -0.231172 0.037930 -0.450824 -0.451344 -0.446120 -0.404121 -0.402318 -0.382320 -0.392884 -0.370233 -0.376004 -0.489435 0.171018 0.189089 0.185394 0.206191 0.196028 0.189355 0.191472 0.193929 0.195838 0.189834 0.191348 0.194945 0.197743 0.186800 0.194742 0.206100 0.190376 0.191990 0.218962 0.216101 0.252234 0.252584 0.374867
chargesum: 0.00000
title: Mulliken charges with hydrogens summed into heavy atoms:
elementType: O O C C C C C C C C C C C C
charge: -0.043231 -0.231172 0.227019 -0.059239 -0.065961 -0.060719 -0.018449 -0.016025 0.002223 0.007958 0.012134 0.059059 0.015383 0.171018
polarizability: 1.69651548e+02 8.59105576e-01 1.23392485e+02 -1.72094991e+00 -3.92553354e+00 1.05995563e+02
1716.lowfreq: -19.4022 -5.8738 -0.0007 -0.0005 0.0002 7.6790 13.7765 22.8689 39.2416
frequency: 10.7316 19.5584 38.9548 41.0148 72.6851 106.6445 113.5505 134.1584 167.6579 175.4280 215.0386 249.4448 314.6804 348.1204 372.2059 427.7960 428.6071 456.7852 497.2533 500.6436 549.0047 590.8428 637.7645 721.8310 741.1678 773.8317 782.8848 815.0888 841.2725 856.3118 871.3057 886.3910 910.7501 938.2497 955.2624 1001.9175 1027.4289 1029.6214 1046.0200 1052.3868 1057.5519 1077.7202 1081.1786 1100.3635 1101.0293 1115.0660 1119.1950 1160.6805 1184.9392 1215.2217 1225.2074 1242.4101 1252.1475 1256.6630 1259.2507 1276.3764 1280.8878 1288.3371 1294.1465 1307.5230 1314.3420 1332.8388 1334.9047 1337.9577 1339.3417 1345.7702 1356.9000 1361.5308 1372.0495 1436.8209 1454.4970 1459.3834 1461.7278 1462.7803 1463.3748 1467.4154 1471.8143 1476.0799 1484.8587 1669.2439 2929.6664 2942.8110 2950.2151 2951.3370 2957.1949 2962.8082 2962.8457 2963.9475 2964.5256 2985.5666 2988.0332 2994.8479 2997.0522 3013.1806 3023.2732 3024.3178 3026.5745 3028.2633 3035.8161 3038.8903 3061.1132 3511.6059
redmass: 5.6783 4.7800 1.8860 3.8570 3.0507 3.3462 1.8726 2.7504 2.9120 3.8588 1.7802 3.7006 1.7611 3.8563 3.1705 2.1410 2.9629 2.4002 2.8046 1.9341 2.0179 4.1553 1.3172 1.0898 1.2807 1.9507 1.5780 1.4111 2.1226 4.6688 1.6579 1.6428 1.7675 1.4046 2.5095 3.8209 1.6049 2.6785 2.2294 1.9782 1.1565 1.8686 1.9349 2.0221 2.3622 2.5840 1.4335 1.9882 1.5181 1.4225 1.3490 1.3543 1.3538 1.2866 1.2494 1.2273 1.2547 1.0903 1.1479 1.3769 1.2463 1.4047 1.4096 1.5034 1.5713 1.5450 1.5670 1.5245 1.8218 1.0846 1.0827 1.0879 1.0846 1.0804 1.0778 1.0813 1.0928 1.0954 1.0996 8.2092 1.0802 1.0592 1.0618 1.0589 1.0634 1.0609 1.0604 1.0612 1.0668 1.0611 1.0961 1.0598 1.1008 1.0979 1.0976 1.0979 1.1001 1.0987 1.1022 1.1035 1.1031 1.0639
irintensity: 0.7981 0.1808 0.0688 0.2213 0.0781 0.6713 0.1886 0.2867 0.4708 0.3805 0.0818 0.9476 0.0557 2.3878 6.4436 5.4932 0.2318 4.2438 18.2970 25.8004 5.6125 12.0218 128.2024 15.0851 2.0988 0.5004 0.1574 2.7013 7.5845 1.3747 3.9787 10.6979 0.5452 1.0173 3.1468 116.3701 4.7000 47.4316 74.2083 22.0444 0.2381 24.1580 0.1996 17.9014 5.4142 0.2385 1.0294 6.0823 4.3460 5.8344 13.3763 1.4128 3.3886 5.0405 1.2250 0.3926 9.2731 0.1658 1.3776 12.8943 3.2337 2.7496 4.5228 0.8131 0.6190 13.4250 4.2637 1.1242 29.5305 27.4802 0.5446 3.9565 4.3889 1.5847 8.0931 17.5763 3.3035 1.7182 20.5902 206.4627 5.8083 7.9393 20.5975 17.0905 65.3708 27.9320 61.4086 50.3869 25.0113 5.1063 10.6717 37.5920 0.7244 67.1938 94.4090 33.9796 20.6099 3.3477 46.8427 159.0692 84.3254 17.5884
temp: 298.150 k
press: 1.00000 atm
elementType: 8 8 6 6 6 6 6 6 6 6 6 6 6 6 1 1 1 1 1 1 1 1 1 1 1 1 1 1 1 1 1 1 1 1 1 1
symmnumber: 1
zpe: 839382.0 jmol-1
zpe.correction: 0.319704 hartree
zpe.thermalcorrener: 0.335574 hartree
zpe.thermalcorrenthalpy: 0.336518 hartree
zpe.thermalcorrgfe: 0.272568 hartree
zpe.sumelectzpe: -619.801550 hartree
zpe.sumelectthermal: -619.785680 hartree
zpe.sumelectthermalent: -619.784736 hartree
zpe.sumelectthermalfe: -619.848685 hartree
dipole: 0.4149 -1.3212 0.6061
dipole: 1.5116
quadrupole: -84.9175 -92.4164 -87.3919
quadrupole: 4.7675 -2.7703 2.8874
quadrupole: 3.3244 -4.1744 0.8501 4.7675 -2.7703 2.8874
hfenergy: -620.1212534 hartree
pointgroup: C01 [X(C12H22O2)]
dipole: 0.1688785 0.5142494 -0.2464031 debye
polarizability: 169.6303827|-1.3794133|123.2976248|1.5965507|-4.2004649|106.1115884 unknown
InChI: InChI=1S/C12H22O2/c13-12(14)10-6-2-5-9-11-7-3-1-4-8-11/h11,13H,1-10H2
charge 0 multiplicity 1
36 atoms
O  -6.362978 0.441003 -0.393415
O  -5.245229 -1.313235 0.635962
C  2.51641 0.2755 0.287053
C  2.79299 -1.045453 -0.478413
C  3.690762 1.267699 0.073912
C  1.167588 0.922955 -0.121966
C  4.16007 -1.666153 -0.101286
C  5.059534 0.652574 0.45257
C  5.316221 -0.662548 -0.32033
C  -0.085875 0.089457 0.229928
C  -1.408165 0.78437 -0.166359
C  -2.651842 -0.065546 0.174426
C  -3.962847 0.611798 -0.266671
C  -5.197139 -0.207248 0.055093
H  2.468957 0.035201 1.373625
H  2.776836 -0.830733 -1.568878
H  1.987248 -1.779347 -0.285096
H  3.511242 2.189942 0.662576
H  3.711256 1.571484 -0.994945
H  1.084528 1.915675 0.36977
H  1.181322 1.119239 -1.215921
H  4.334477 -2.587604 -0.690738
H  4.140146 -1.969013 0.966637
H  5.075892 0.441937 1.542398
H  5.871417 1.379822 0.255012
H  6.279521 -1.110386 -0.006911
H  5.403038 -0.437191 -1.403847
H  -0.092707 -0.119448 1.320286
H  -0.03976 -0.895435 -0.275939
H  -1.392087 0.999258 -1.255859
H  -1.475312 1.768159 0.344121
H  -2.687148 -0.262347 1.263073
H  -2.571605 -1.057209 -0.311315
H  -3.962759 0.809091 -1.356894
H  -4.081254 1.603829 0.212767
H  -7.153253 -0.121095 -0.166427
