program: Gaussian 09
title: 000220010
version: EM64L-G09RevD.01
frameworkgroup: C1[X(C4H10O2)]
method: RPBEPBE
basis: SDD
operation: Freq
keyword: #pfreq=noraman
keyword: PBEPBE/SDD
title: #p freq=noraman PBEPBE/SDD
converged: YES YES NO NO
title: Mulliken charges:
elementType: O O C C C C H H H H H H H H H H
charge: -0.451386 -0.435226 -0.049526 -0.054171 -0.686248 -0.749049 0.172457 0.226724 0.225245 0.230416 0.224983 0.253931 0.200522 0.228503 0.339270 0.323554
chargesum: 0.00000
title: Mulliken charges with hydrogens summed into heavy atoms:
elementType: O O C C C C
charge: -0.112116 -0.111672 0.122932 0.172553 -0.005604 -0.066093
polarizability: 5.33904455e+01 -2.00309223e+00 5.42701526e+01 -2.01195209e+00 -4.86346422e-01 4.60521150e+01
1716.lowfreq: -13.1771 -0.0010 -0.0005 0.0009 8.2165 16.7003 85.1559 208.6083 215.6405
frequency: 85.1124 208.5655 215.6289 242.5000 292.0488 313.3709 356.1774 375.0772 413.0230 447.6039 517.2952 796.1253 860.0638 888.9979 976.4319 1026.8267 1029.0346 1078.7509 1100.1943 1166.6291 1217.9979 1232.9141 1298.8597 1332.6068 1359.0689 1369.1282 1383.4610 1389.4592 1465.0233 1467.9006 1475.7087 1482.8206 2900.4711 2964.8128 2997.0457 3047.5001 3071.1219 3092.5584 3097.3862 3107.5287 3535.8043 3563.2004
redmass: 3.2277 1.3375 1.5360 1.2912 1.2751 1.7828 2.2328 1.2580 2.8102 4.3253 2.7991 2.1502 2.7673 2.3016 1.2172 2.0021 1.7618 1.8065 2.4857 1.9692 1.3686 1.3331 1.3372 1.2347 1.2080 1.4623 1.2315 1.3784 1.0447 1.0510 1.0519 1.0483 1.0835 1.0407 1.0356 1.0879 1.0935 1.0983 1.0995 1.1004 1.0658 1.0658
irintensity: 2.0006 1.1817 12.4696 12.6303 54.1844 80.7834 2.4967 155.3004 29.9590 2.5498 16.3729 5.7118 31.6751 5.6733 23.5707 149.0760 4.2102 22.5456 18.0794 4.0433 11.1290 45.4866 10.7411 1.1056 10.7924 18.2475 38.7857 15.6911 11.6251 8.9463 3.4142 16.4696 67.9768 23.7104 15.9505 3.6430 49.4222 18.5519 37.6914 18.3288 4.6574 4.7058
temp: 298.150 k
press: 1.00000 atm
elementType: 8 8 6 6 6 6 1 1 1 1 1 1 1 1 1 1
symmnumber: 1
zpe: 360326.2 jmol-1
zpe.correction: 0.137241 hartree
zpe.thermalcorrener: 0.145198 hartree
zpe.thermalcorrenthalpy: 0.146142 hartree
zpe.thermalcorrgfe: 0.105963 hartree
zpe.sumelectzpe: -308.332604 hartree
zpe.sumelectthermal: -308.324647 hartree
zpe.sumelectthermalent: -308.323703 hartree
zpe.sumelectthermalfe: -308.363882 hartree
dipole: -1.3447 1.2080 1.9938
dipole: 2.6912
quadrupole: -41.5029 -39.6541 -35.0807
quadrupole: -4.9011 -1.2233 -0.4033
quadrupole: -2.7570 -0.9082 3.6652 -4.9011 -1.2233 -0.4033
hfenergy: -308.4698454 hartree
pointgroup: C01 [X(C4H10O2)]
dipole: -0.4821236 -0.5072259 -0.794587 debye
dipolederiv: -0.5206697 0.2316124 0.1743883 0.2281083 -0.7385001 0.1090282 0.1873542 0.1111967 -0.4051445 -0.7362276 0.1165805 0.006604 0.0566016 -0.7110327 0.176617 0.0275785 0.2039913 -0.156529 0.3376033 -0.0829942 -0.0020988 -0.1404349 0.6110116 -0.0361624 0.017673 -0.0563354 0.3676574 0.403881 -0.0305115 0.0392039 -0.0531443 0.507032 -0.1180304 0.0418606 -0.1257383 0.2537024 -0.0707476 -0.1187337 -0.0359045 -0.0389539 -0.0871361 -0.0380839 -0.0285922 -0.0496259 0.0444268 -0.1637887 -0.1235336 0.0028729 -0.0620677 -0.156995 0.0212549 0.0181602 -0.0041474 0.0918838 -0.0240622 0.0392257 -0.0898756 0.017609 -0.0378292 0.0104244 -0.0520112 0.0408758 -0.2530488 0.0370733 0.0026241 -0.0411405 0.0017887 0.0164864 -0.0307782 -0.0204612 -0.0110343 -0.1267735 0.083149 -0.0227072 -0.0150141 0.0013313 0.0912656 0.054752 -0.0554544 0.0173887 -0.1285317 0.0980999 0.0997903 -0.0136654 0.0571898 -0.0758454 0.0177009 -0.0129861 0.0313992 0.09741 -0.1272063 -0.0354419 0.0933248 -0.0030814 0.0979101 -0.0145671 0.10992 -0.0075999 0.0314866 -0.1227494 0.002059 0.0619934 0.0407752 0.0924001 -0.0237349 0.063565 -0.020201 0.0805963 0.0930976 -0.0150081 0.0316145 -0.0146195 0.0574867 -0.0097575 -0.0276059 -0.0645969 -0.1780319 0.0943054 0.0829427 -0.0532691 0.0475406 -0.0948374 0.0776323 -0.0445616 0.0818179 0.0494185 0.2440423 -0.1590021 -0.1554096 -0.1380961 0.1585138 -0.0650663 -0.1691786 -0.0771078 0.2424865 0.3741997 0.0130976 -0.0036243 -0.0005466 0.2700695 -0.131229 -0.0552602 -0.0702828 -0.011009 unknown
polarizability: 53.0737688|1.9831475|54.4523506|2.2247368|-0.4065959|46.1865937 unknown
InChI: InChI=1S/C4H10O2/c1-3(5)4(2)6/h3-6H,1-2H3
charge 0 multiplicity 1
16 atoms
O  1.308356 -1.344882 -0.008534
O  -1.313836 1.383253 -0.214082
C  0.706137 -0.042883 -0.366577
C  -0.710681 0.114473 0.255611
C  1.679679 1.023818 0.136515
C  -1.639263 -1.077603 -0.031145
H  0.596358 0.031081 -1.476032
H  -0.613005 0.263749 1.345102
H  1.89059 0.855011 1.207529
H  1.237915 2.027672 0.015768
H  2.634117 0.974433 -0.414305
H  -2.659006 -0.846323 0.321363
H  -1.694312 -1.297452 -1.117324
H  -1.301189 -1.988323 0.495272
H  0.808087 -2.072756 -0.457388
H  -1.503843 1.299833 -1.184575
