program: Gaussian 09
title: 000220001
version: EM64L-G09RevD.01
frameworkgroup: C1[X(C6H12O5)]
method: RPBEPBE
basis: SDD
operation: Freq
keyword: #pfreq=noraman
keyword: PBEPBE/SDD
title: #p freq=noraman PBEPBE/SDD
converged: YES YES NO NO
title: Mulliken charges:
elementType: O O O O O C C C C C C H H H H H H H H H H H H
charge: -0.485653 -0.512197 -0.444084 -0.416088 -0.214005 -0.087036 -0.196720 -0.066882 -0.150927 -0.708058 -0.049922 0.216229 0.273655 0.210652 0.251307 0.237777 0.204606 0.243398 0.374159 0.386708 0.213354 0.353895 0.365831
chargesum: 0.00000
title: Mulliken charges with hydrogens summed into heavy atoms:
elementType: O O O O O C C C C C C
charge: -0.111494 -0.125489 -0.090189 -0.050257 -0.214005 0.129193 0.076935 0.143771 0.100380 -0.022277 0.163431
polarizability: 9.01071737e+01 -2.70451509e+00 8.03509751e+01 -4.39765649e+00 1.58208650e+00 7.11872870e+01
1716.lowfreq: -16.4969 -7.8262 -0.0010 -0.0008 -0.0004 9.6593 51.1544 67.0473 89.9447
frequency: 50.7257 67.0299 89.9290 125.2376 142.6446 178.3936 220.4159 223.2550 259.3766 276.3591 312.5885 335.1776 376.2849 457.1007 476.8373 511.8398 527.7083 563.6752 577.4438 644.6251 662.2834 760.8738 820.0013 831.1887 886.3263 909.7730 951.2072 962.9361 984.1467 1027.1755 1033.9300 1075.3062 1102.0189 1114.1233 1190.9928 1199.6010 1228.5097 1259.7072 1291.9473 1310.0597 1323.3989 1336.9077 1337.7493 1364.5626 1374.2022 1379.2825 1386.5555 1395.8007 1465.4665 1476.1268 1610.6643 2952.0681 2985.7300 2990.8101 3023.8417 3027.1740 3054.1635 3083.4994 3105.3224 3446.2178 3477.1440 3488.0395 3490.9183
redmass: 5.2666 6.2407 4.2825 3.8452 6.6205 4.5045 1.1260 5.2033 3.6509 3.7354 3.7253 3.8029 3.8646 2.7170 2.6468 1.1667 1.2315 1.4124 3.1799 1.2088 2.4077 3.7808 3.6577 4.1184 2.4346 2.3509 2.4695 3.1025 2.5441 2.1704 2.2855 2.2182 2.3535 1.8222 1.2562 1.2653 1.2990 1.4024 1.3053 1.2707 1.3626 1.3049 1.2061 1.2964 1.2197 1.3863 1.2241 1.6580 1.0541 1.0537 7.9916 1.0888 1.0449 1.0748 1.0859 1.0849 1.0854 1.0978 1.1009 1.0649 1.0646 1.0643 1.0653
irintensity: 0.4990 6.0856 5.9745 11.1706 6.6359 15.9844 0.5138 8.2592 7.5981 5.5362 25.9542 6.3705 7.7246 2.5693 20.5599 65.6829 98.4948 242.7187 11.0319 211.1121 71.2734 6.2132 35.4323 8.5935 26.0004 8.3963 56.1977 61.1902 10.7256 9.9517 39.3930 50.6641 2.2969 76.3271 69.4987 56.8935 9.9496 28.0509 15.0649 35.9767 13.3320 1.6036 7.1592 27.1477 62.2721 35.2978 30.3722 14.2055 13.8562 7.7137 102.4597 83.1779 8.7111 34.7283 30.9809 9.9166 19.3497 34.2637 21.5582 22.3589 74.0942 12.0685 39.7343
temp: 298.150 k
press: 1.00000 atm
elementType: 8 8 8 8 8 6 6 6 6 6 6 1 1 1 1 1 1 1 1 1 1 1 1
symmnumber: 1
zpe: 482061.6 jmol-1
zpe.correction: 0.183608 hartree
zpe.thermalcorrener: 0.196178 hartree
zpe.thermalcorrenthalpy: 0.197122 hartree
zpe.thermalcorrgfe: 0.144968 hartree
zpe.sumelectzpe: -611.011708 hartree
zpe.sumelectthermal: -610.999138 hartree
zpe.sumelectthermalent: -610.998194 hartree
zpe.sumelectthermalfe: -611.050348 hartree
dipole: -1.1353 -0.8636 -0.6908
dipole: 1.5849
quadrupole: -71.6102 -63.1304 -72.2687
quadrupole: 0.1783 -1.4861 -3.3463
quadrupole: -2.6071 5.8727 -3.2656 0.1783 -1.4861 -3.3463
hfenergy: -611.1953158 hartree
pointgroup: C01 [X(C6H12O5)]
dipole: -0.4746065 0.1918771 0.3560433 debye
dipolederiv: -0.5324634 0.1527232 -0.0295473 0.1384396 -0.7430561 0.0053436 -0.0734044 0.0303929 -0.5154877 -0.7442498 -0.0865016 0.1170796 -0.0929497 -0.7550378 -0.0731462 0.0824487 -0.0449898 -0.3456832 -0.6982492 -0.1479373 0.0902996 -0.1762527 -0.3066223 -0.1151828 0.0617159 -0.126682 -0.7311921 -0.7077526 0.0567897 -0.0074298 0.1037467 -0.2385044 0.0711309 0.0363934 0.0669551 -0.63927 -0.5755913 0.0153259 -0.1827157 -0.0597825 -0.5518138 -0.310188 -0.2120828 -0.1489358 -0.5486703 0.2085115 -0.1393663 0.0021327 -0.096549 0.4322243 0.091477 0.0376456 -0.0041928 0.2632369 0.2892078 0.1825228 -0.066948 0.1269655 0.3558121 -0.0328237 -0.0266804 0.0608009 0.1203974 0.451151 0.0148436 -0.0155521 0.0986481 0.3149091 0.1152532 -0.0061638 0.136639 0.5446313 0.1712825 0.0711602 -0.0764587 0.0053274 0.1778791 -0.0677581 -0.2156351 -0.1248526 0.2444579 -0.1522272 -0.0340632 -0.1203596 -0.046564 0.027563 -0.0152671 -0.0465776 -0.0005433 -0.0645693 0.6926183 -0.1136272 0.3100569 -0.1167198 0.536386 0.3636844 0.3779601 0.3129567 0.5204987 0.04051 0.0282679 0.0577172 0.010484 -0.0072803 -0.0118748 0.0306496 -0.0592701 -0.1399679 0.1039937 -0.0143198 0.0295622 0.0114112 0.0010851 0.0003002 0.0013177 0.0268085 -0.0657213 -0.0205284 0.1205403 -0.0035195 0.1305489 -0.0902786 -0.0104699 -0.0248314 0.0082265 0.0168348 0.0756624 -0.0729051 0.012748 -0.0813468 -0.0709523 0.028475 -0.0145967 -0.0101804 0.04683 -0.0445022 -0.1056431 0.0308664 -0.1202125 0.0000251 0.0537539 0.0611207 0.0701313 0.0568899 0.0642435 0.0325612 0.0628565 0.0151399 0.0687991 -0.0837469 0.0248989 -0.0899158 -0.1293993 0.0658284 0.0598167 -0.0243064 0.1186196 -0.0568601 0.0245853 -0.0098751 -0.0026823 0.0909743 0.3296916 -0.1266036 0.0454149 -0.1027246 0.3049033 -0.0180754 0.0821207 -0.0230637 0.3271229 0.3054853 -0.0787093 -0.0803571 -0.0468983 0.409201 0.0675767 -0.0375333 -0.000817 0.2262578 -0.1057686 0.1350396 -0.0238184 0.1494132 -0.0835882 -0.066624 0.0292295 -0.0859549 0.0917617 0.401618 0.0936524 -0.0563164 0.1159098 0.1416892 0.011008 -0.0881657 0.0497759 0.3049185 0.3815286 -0.0435671 -0.071405 -0.0846541 0.1335176 -0.0274314 -0.0699545 -0.0406065 0.3251492 unknown
polarizability: 89.4447459|1.0528938|77.9747226|5.7732514|4.6223998|74.2259674 unknown
InChI: InChI=1S/C6H12O5/c1-3(8)5(10)6(11)4(9)2-7/h2-6,8-11H,1H3
charge 0 multiplicity 1
23 atoms
O  1.739951 -1.678272 0.164981
O  -0.891685 -1.742096 -0.054457
O  2.344716 0.349841 -1.561738
O  -1.66671 0.421927 1.546737
O  -2.931264 -0.308924 -1.409697
C  1.061961 -0.392734 0.391047
C  -0.292209 -0.412467 -0.349818
C  2.023283 0.686146 -0.165666
C  -1.279789 0.659714 0.139684
C  3.291266 0.816359 0.694561
C  -2.607321 0.627385 -0.632284
H  0.890828 -0.233958 1.475623
H  -0.114115 -0.306478 -1.437506
H  1.504533 1.660977 -0.223432
H  -0.837277 1.670417 0.116505
H  3.999912 1.509467 0.210966
H  3.050083 1.205628 1.701585
H  3.777852 -0.167713 0.812348
H  1.022082 -2.369143 0.150649
H  -1.614648 -1.889399 -0.723547
H  -3.31908 1.448175 -0.385778
H  2.613912 -0.609367 -1.543687
H  -1.779879 -0.568183 1.624227
