program: Gaussian 09
title: 000219995
version: EM64L-G09RevD.01
frameworkgroup: C1[X(C9H7ClOS)]
method: RPBEPBE
basis: SDD
operation: Freq
keyword: #p
keyword: freq=noraman
keyword: PBEPBE/SDD
title: #p freq=noraman PBEPBE/SDD
converged: YES YES NO NO
title: Mulliken charges:
elementType: Cl S O C C C C C C C C C H H H H H H H
charge: -0.056405 0.269575 -0.423765 0.297751 0.445091 -0.373589 0.232031 -0.416809 -0.291911 -0.868375 -0.092402 -0.634445 0.258446 0.272852 0.244834 0.226237 0.256637 0.283613 0.370635
chargesum: 0.00000
title: Mulliken charges with hydrogens summed into heavy atoms:
elementType: Cl S O C C C C C C C C C
charge: -0.056405 0.269575 -0.053130 0.297751 0.445091 -0.373589 0.232031 -0.158364 -0.019058 -0.140667 -0.092402 -0.350832
polarizability: 1.81177862e+02 -8.99378075e+00 1.42957459e+02 -1.22165068e-02 -3.57622530e-01 5.19093889e+01
1716.lowfreq: -0.0029 -0.0016 0.0016 2.3546 5.7772 8.7474 64.8806 89.9293 138.1940
frequency: 64.8491 89.9208 138.1936 181.8444 205.9330 244.4925 265.4436 274.5180 286.6099 289.2302 377.0035 416.2096 493.4907 503.6883 511.1471 518.8178 576.7713 601.1737 655.8435 732.2285 738.2823 776.6551 813.4373 861.3409 867.7555 898.7867 990.6778 1042.1619 1059.9495 1100.8806 1117.9106 1173.3071 1212.3379 1241.2712 1339.3034 1364.8912 1396.3370 1404.2281 1440.8413 1485.3710 1489.6870 1546.7342 1578.9753 1605.9132 2953.1483 3030.3105 3085.3244 3159.2580 3172.7499 3253.8739 3608.4200
redmass: 1.9127 2.6667 4.1356 11.2754 3.0766 1.6582 3.5679 2.2993 4.3882 5.0050 6.5913 8.0511 5.4732 4.8514 3.8813 9.8692 5.1109 3.0856 5.4635 6.2932 1.4126 9.4857 4.2467 1.3964 1.3306 6.2115 1.5908 1.5130 5.8233 1.7040 1.2329 3.4803 1.4608 1.6274 3.1470 4.4102 1.2631 5.5712 4.4899 1.0567 1.0982 7.5358 6.3632 6.6676 1.0416 1.0967 1.0944 1.0924 1.0937 1.0958 1.0657
irintensity: 23.6418 57.6600 24.7934 1.3378 0.1322 0.3015 1.5764 21.3834 11.4939 9.9955 0.3224 3.1631 4.5731 3.9943 0.1126 1.2371 0.6839 0.8397 27.7973 0.2915 66.0105 46.6459 37.0632 29.9317 7.9793 11.2899 4.2443 6.3161 42.5384 26.3037 68.7025 37.6058 18.7151 0.0813 119.2626 14.1740 17.1571 11.8740 14.0659 19.4033 40.3181 2.5199 47.4799 54.2216 28.2650 14.7436 16.1883 2.5994 0.4358 5.2252 55.3167
temp: 298.150 k
press: 1.00000 atm
elementType: 17 16 8 6 6 6 6 6 6 6 6 6 1 1 1 1 1 1 1
symmnumber: 1
zpe: 348337.8 jmol-1
zpe.correction: 0.132675 hartree
zpe.thermalcorrener: 0.143914 hartree
zpe.thermalcorrenthalpy: 0.144858 hartree
zpe.thermalcorrgfe: 0.095203 hartree
zpe.sumelectzpe: -1279.642469 hartree
zpe.sumelectthermal: -1279.631230 hartree
zpe.sumelectthermalent: -1279.630286 hartree
zpe.sumelectthermalfe: -1279.679941 hartree
dipole: 0.4361 2.3297 -0.2523
dipole: 2.3835
quadrupole: -92.7158 -71.5576 -87.8425
quadrupole: -0.5319 -0.8468 -0.6773
quadrupole: -8.6772 12.4810 -3.8039 -0.5319 -0.8468 -0.6773
hfenergy: -1279.7751441 hartree
pointgroup: C01 [X(C9H7Cl1O1S1)]
dipole: -0.1836023 0.9146401 0.09547 debye
dipolederiv: -0.9136299 0.047755 -0.0106053 0.0967301 -0.140698 0.0015919 -0.0099261 0.0010858 -0.0685974 -0.1631178 0.0499975 -0.0030298 -0.2141812 -0.2568589 -0.0039116 -0.000966 -0.0098798 0.1048079 -0.5280542 0.4969018 0.0520883 0.5417643 -0.940873 0.0391751 0.0432302 0.0646889 -0.3754894 0.0234665 0.3162312 -0.0001578 -0.0334126 -0.4132244 -0.0009132 -0.0014114 0.0147581 0.0024849 0.1818825 -0.1634078 0.0050037 -0.0080304 0.2585011 -0.0044714 0.0028089 -0.0039566 -0.0175506 0.2435004 0.3042478 0.0100524 0.3733462 0.3235315 0.0081113 0.0056995 0.0107315 -0.0995063 0.3502396 -0.5917756 -0.015775 -0.6014981 0.7449061 -0.0193708 -0.0089996 -0.0230952 0.0598882 -0.3593 0.2139539 -0.0039469 0.0664389 -0.1536319 0.0016088 -0.004707 0.0003856 -0.1455608 -0.3738752 -0.0888639 -0.0052825 -0.1143146 -0.1229622 -0.0019925 -0.003645 -0.0026838 -0.0864721 -0.0160792 0.0431848 -0.0102532 0.006005 -0.0966212 0.0053158 -0.0171854 0.0093083 0.0694379 1.248939 -0.1229214 0.0168461 -0.0771719 0.3021504 -0.0021589 0.0156166 -0.0033443 -0.061973 -0.1201875 -0.3965359 0.0015771 0.0424971 0.0543897 0.0039196 0.0018044 -0.0055631 -0.3471546 0.0509531 -0.064428 -0.0008083 -0.0765635 -0.011779 0.0005445 0.0002309 0.0017407 0.1616094 0.0851959 0.0143467 -0.0013879 0.0508466 0.0133194 0.0009465 -0.0008814 -0.000121 0.1730994 0.0113898 0.0836324 -0.1042709 0.0274958 0.0343592 -0.0040653 -0.1045417 0.029836 -0.0200322 -0.0085349 0.0933241 0.1149059 0.0349783 0.0266968 0.0005591 0.1201284 -0.0386944 -0.0341719 -0.0381716 -0.1789117 0.0034423 -0.0421931 0.0084225 0.0014599 0.0062633 0.0051377 0.1189864 0.0219769 0.0078479 -0.0009167 0.0174307 0.0920259 -0.0003392 -0.0004681 0.0012656 0.2334807 0.3034064 -0.0645787 -0.0474814 -0.0901672 0.2783459 -0.0260096 -0.0430506 -0.0516002 0.3327135 unknown
polarizability: 180.9410581|9.4423219|143.177568|1.5105022|0.3089916|51.9260838 unknown
InChI: InChI=1S/C9H7ClOS/c1-5-2-6(10)3-8-9(5)7(11)4-12-8/h2-4,11H,1H3
charge 0 multiplicity 1
19 atoms
Cl 4.022777 -0.454121 0.046918
S  -1.262386 -2.434563 -0.026503
O  -2.910113 1.210218 -0.046442
C  -0.572364 0.17475 -0.007538
C  0.301959 1.310635 -0.006265
C  -0.000207 -1.138297 0.002248
C  -2.036466 0.112367 -0.020654
C  1.693879 1.083984 0.010826
C  1.390531 -1.368836 0.01874
C  -0.213508 2.742276 -0.031812
C  2.21209 -0.233259 0.025302
C  -2.545989 -1.168157 -0.028558
H  2.38412 1.932798 0.010746
H  1.811661 -2.37733 0.024116
H  -0.829459 2.945632 -0.929659
H  -0.804676 2.990073 0.874341
H  0.625469 3.45712 -0.053885
H  -3.592733 -1.460495 -0.037769
H  -2.427485 2.054502 0.122548
