program: Gaussian 09
title: 000219980
version: EM64L-G09RevD.01
frameworkgroup: C1[X(C13H20N2O6)]
method: RPBEPBE
basis: SDD
operation: Freq
keyword: #p
keyword: freq=noraman
keyword: PBEPBE/SDD
title: #p freq=noraman PBEPBE/SDD
converged: YES YES NO NO
title: Mulliken charges:
elementType: O O O O O O N N C C C C C C C C C C C C C H H H H H H H H H H H H H H H H H H H H
charge: -0.508573 -0.485818 -0.475185 -0.444919 -0.470229 -0.281957 -0.370701 -0.375222 -0.180248 -0.105536 -0.098606 -0.068166 -0.204825 -0.724415 0.153234 0.448199 -0.414870 -0.356329 -0.197828 -0.219156 -0.263467 0.281429 0.238872 0.244207 0.228067 0.237461 0.244089 0.246436 0.200543 0.396140 0.372788 0.376548 0.356887 0.377458 0.390408 0.309678 0.225716 0.243404 0.224346 0.222157 0.227981
chargesum: 0.00000
title: Mulliken charges with hydrogens summed into heavy atoms:
elementType: O O O O O O N N C C C C C C C C C C C C C
charge: -0.112432 -0.113031 -0.098636 -0.088032 -0.092771 -0.281957 0.019707 -0.065544 0.101180 0.133336 0.145602 0.159901 0.032636 -0.033347 0.153234 0.448199 -0.189154 -0.112925 0.026518 0.003001 -0.035486
polarizability: 2.28920428e+02 1.61514470e+01 1.40631508e+02 -4.77080217e+00 -1.50159248e+00 1.58715536e+02
1716.lowfreq: -15.4117 -1.8541 -0.0007 -0.0007 -0.0003 11.6708 16.1890 22.7956 42.9056
frequency: 11.2764 22.5646 42.8573 56.8788 61.4428 62.1566 76.9261 106.6209 119.4341 154.0120 185.3134 209.0194 218.6549 223.2778 240.1514 245.5140 269.1239 276.3900 284.5381 317.2563 332.3446 370.0478 374.7261 409.4985 416.2403 435.6199 442.9522 468.2607 476.5001 485.9088 501.5741 514.4299 518.6236 548.9835 573.8865 613.5951 620.8166 635.9835 653.7886 697.1755 732.1387 755.4230 797.3389 810.0119 812.5538 827.7925 832.1700 887.6686 900.4885 905.2730 922.1903 940.6049 963.5050 973.0709 980.5247 983.8621 1006.2638 1008.7748 1024.2108 1039.3485 1058.6165 1079.6460 1083.3767 1098.0029 1120.6453 1135.1994 1171.4046 1185.7253 1193.8028 1205.6510 1213.0135 1238.8529 1247.0830 1262.8452 1271.2293 1289.5368 1303.1713 1315.4966 1319.4588 1336.5915 1348.2820 1358.5342 1369.4254 1379.3019 1382.5839 1386.3645 1391.3708 1399.7382 1430.7619 1466.8851 1476.4081 1479.5778 1487.4512 1575.7415 1596.1102 1612.0790 1622.4153 2951.8919 2959.4332 2979.2873 2982.2852 3022.5959 3033.6297 3077.5567 3106.8764 3120.7260 3124.9065 3140.1359 3147.0353 3167.4175 3192.8218 3349.8777 3518.9446 3524.8153 3540.7036 3548.2385 3558.2660
redmass: 5.7247 5.7039 5.1265 4.7918 4.5072 4.8332 6.7793 5.9234 5.4719 4.9819 4.9310 4.1369 4.0590 1.2655 2.9243 2.9898 2.9510 3.6227 4.8527 5.0037 4.5960 5.7310 3.6436 2.9364 2.5286 1.1807 3.1183 1.5945 1.7184 1.3698 2.3604 1.7751 3.1071 5.1298 3.0275 5.7954 1.3226 2.9582 4.4270 2.0343 4.7946 1.6804 5.0202 3.8333 3.5716 3.0357 1.3861 1.5208 2.3253 3.0736 1.7841 2.4983 1.4782 2.8280 3.3306 1.5569 5.8712 2.8022 2.1672 1.7891 2.3058 2.2320 1.7150 2.2429 2.0038 3.5401 1.0478 1.1177 1.1832 1.2616 1.2136 1.2200 2.0366 1.2720 1.3151 1.3683 2.4623 1.3077 1.4268 1.4633 1.3874 1.3773 1.4332 1.4373 3.1916 1.4917 1.3069 1.5586 2.0544 1.0517 1.0548 1.6191 2.3538 1.8531 4.9407 3.4710 4.6736 1.0818 1.0831 1.0830 1.0386 1.0855 1.0860 1.0954 1.1008 1.0859 1.0869 1.0915 1.0963 1.1012 1.0892 1.0640 1.0651 1.0768 1.0653 1.0650 1.0655
irintensity: 0.7708 0.9296 0.2637 0.7356 2.3584 1.8669 2.3200 1.6513 5.7348 8.1858 6.4247 12.1288 9.0032 1.9521 12.6244 5.9957 8.4988 2.1481 14.1161 11.8585 45.4602 23.0965 7.0515 4.4437 121.1043 62.2304 8.4199 34.8404 197.5111 204.7248 97.2495 31.8194 54.1591 3.1484 32.2207 9.4290 137.7916 27.9366 32.5215 27.6176 50.7094 100.2437 19.2802 23.8229 2.8703 0.8351 2.8548 22.4352 12.5149 24.0850 16.0404 83.6332 3.7931 81.0931 1.2690 4.7786 34.7266 142.9698 4.3832 50.5084 31.6195 4.2270 8.5185 38.5653 99.1845 26.5377 0.4970 13.0421 26.6666 54.0466 23.6000 40.4295 85.2325 56.8794 11.9113 0.6319 9.2533 25.3260 8.0445 35.8860 20.2149 15.0157 32.5412 41.8724 29.9036 37.1395 39.1325 36.6372 3.0647 10.6407 9.2449 2.3041 108.7777 115.7440 21.6172 110.0022 111.0942 34.8193 33.7900 38.2786 17.5026 47.9021 29.5836 42.1776 15.6584 10.0321 0.5834 9.1607 35.9481 23.9319 531.4420 94.7460 16.8532 28.9296 23.3877 31.1045 23.5478
temp: 298.150 k
press: 1.00000 atm
elementType: 8 8 8 8 8 8 7 7 6 6 6 6 6 6 6 6 6 6 6 6 6 1 1 1 1 1 1 1 1 1 1 1 1 1 1 1 1 1 1 1 1
symmnumber: 1
zpe: 863209.8 jmol-1
zpe.correction: 0.328779 hartree
zpe.thermalcorrener: 0.350679 hartree
zpe.thermalcorrenthalpy: 0.351623 hartree
zpe.thermalcorrgfe: 0.276116 hartree
zpe.sumelectzpe: -1066.559251 hartree
zpe.sumelectthermal: -1066.537352 hartree
zpe.sumelectthermalent: -1066.536408 hartree
zpe.sumelectthermalfe: -1066.611915 hartree
dipole: -0.6322 -1.8878 1.7670
dipole: 2.6619
quadrupole: -132.7140 -133.5069 -119.8154
quadrupole: 2.4614 9.4523 1.4778
quadrupole: -4.0353 -4.8281 8.8634 2.4614 9.4523 1.4778
hfenergy: -1066.8880307 hartree
pointgroup: C01 [X(C13H20N2O6)]
dipole: -0.3483539 -0.8196723 0.5509426 debye
polarizability: 230.6209677|-0.9139905|139.0981263|-10.4913396|-5.0228993|158.5483777 unknown
InChI: InChI=1S/C13H20N2O6/c1-7(16)9(17)10(18)11(19)12(20)13(21)15-14-8-5-3-2-4-6-8/h2-7,9-12,14-20H,1H3
charge 0 multiplicity 1
41 atoms
O  0.582883 -1.781164 0.194965
O  2.692822 -2.8188 -1.252709
O  0.904813 0.167393 2.086016
O  4.672927 -1.223199 -2.290897
O  1.746382 2.604088 0.800787
O  -0.514413 2.72834 -0.524552
N  -0.679678 0.425866 -0.885685
N  -2.002762 0.476051 -1.360549
C  1.93617 -1.199276 0.418922
C  2.667229 -1.385093 -0.919094
C  1.841141 0.242371 0.955331
C  4.151009 -0.939693 -0.945909
C  1.452702 1.404714 0.009567
C  5.021624 -1.602819 0.138012
C  -0.023176 1.553142 -0.467578
C  -3.076883 0.31487 -0.440181
C  -4.407031 0.434245 -0.927445
C  -2.855628 -0.016873 0.922704
C  -5.49647 0.227456 -0.058659
C  -3.959254 -0.230924 1.777836
C  -5.283684 -0.113462 1.299234
H  2.432508 -1.809593 1.197415
H  2.125397 -0.837186 -1.720585
H  2.851722 0.52098 1.322229
H  4.208698 0.160639 -0.860921
H  2.096867 1.383327 -0.896026
H  4.907152 -2.700333 0.111104
H  6.078402 -1.350766 -0.051414
H  4.764807 -1.246414 1.154059
H  0.115153 -1.792594 1.070816
H  1.76619 -3.164265 -1.180147
H  0.851205 1.078253 2.477866
H  4.436981 -2.167888 -2.492646
H  1.082623 3.294452 0.497004
H  -0.285352 -0.518531 -0.692008
H  -2.135968 1.14062 -2.127271
H  -4.581086 0.680534 -1.981984
H  -1.835114 -0.071478 1.317772
H  -6.516988 0.326825 -0.445597
H  -3.778775 -0.480809 2.829867
H  -6.133544 -0.278902 1.969249
