program: Gaussian 09
title: 000219962
version: EM64L-G09RevD.01
frameworkgroup: C1[X(C17H11NO)]
method: RPBEPBE
basis: SDD
operation: Freq
keyword: #p
keyword: freq=noraman
keyword: PBEPBE/SDD
title: #p freq=noraman PBEPBE/SDD
converged: NO YES NO YES
title: Mulliken charges:
elementType: O N C C C C C C C C C C C C C C C C C H H H H H H H H H H H
charge: -0.425635 0.012535 0.303064 0.365072 0.193033 0.370320 0.239203 -0.506071 -0.596502 -0.399297 -0.365702 -0.436084 -0.302537 0.287324 -0.410344 -0.267479 -0.242451 -0.192446 -0.382107 0.221337 0.231635 0.221262 0.303384 0.231928 0.256953 0.228101 0.234468 0.228211 0.242782 0.356041
chargesum: 0.00000
title: Mulliken charges with hydrogens summed into heavy atoms:
elementType: O N C C C C C C C C C C C C C C C C C
charge: -0.069594 0.012535 0.303064 0.365072 0.193033 0.370320 0.239203 -0.506071 -0.375164 -0.167662 -0.144439 -0.132700 -0.070610 0.287324 -0.153390 -0.039378 -0.007983 0.035766 -0.139325
polarizability: 2.84328477e+02 5.10069447e+00 2.66374291e+02 4.64833696e-03 -2.67560076e-03 7.22014580e+01
1716.lowfreq: -0.0008 -0.0006 0.0006 8.3678 15.1791 15.6272 61.4005 77.6048 107.6443
frequency: 61.3921 77.5848 107.6398 137.8466 195.7208 218.4768 239.0384 276.8634 337.7546 338.6573 371.1408 385.1790 406.2012 423.9041 427.9021 440.6539 471.5544 548.2411 563.7134 574.3520 577.6606 612.6046 624.1394 628.9702 688.4586 717.2509 735.1350 740.8057 790.5501 791.2021 809.9142 817.4746 849.1168 876.2276 884.4121 925.5660 954.8516 968.5175 974.5519 978.2211 982.0463 1011.9017 1013.8280 1021.5547 1045.5699 1064.2662 1105.2743 1118.4292 1133.6042 1146.8498 1176.3703 1205.0661 1230.2930 1251.8253 1274.2128 1290.2020 1323.5448 1329.4328 1343.9571 1382.0838 1396.1315 1409.7951 1433.7064 1440.9222 1453.4990 1483.4945 1499.0209 1543.2636 1569.7233 1589.5469 1594.9803 1616.9575 1626.3283 3124.5318 3127.1982 3132.1758 3143.6334 3146.5293 3154.0073 3161.4829 3169.9212 3174.9516 3177.8102 3579.9497
redmass: 4.9850 3.8945 5.3247 3.8319 5.8087 5.0212 5.1332 4.5244 6.2731 3.7058 1.2015 7.1174 6.8916 3.1010 3.0964 5.1809 4.0362 3.2405 6.4146 3.0085 5.4770 7.7844 3.5662 6.7828 6.3970 7.1077 2.3067 2.3506 6.0361 1.6864 1.4747 1.5862 1.9265 1.4657 6.5006 1.5251 1.8211 1.8543 1.5935 8.0994 1.3749 6.9548 1.3999 3.4811 1.9281 2.0891 2.3004 2.0334 1.5020 1.2405 1.0963 1.4126 1.7388 1.4758 3.2787 1.6480 2.7648 2.3086 3.5333 3.0507 3.9459 4.8044 2.6369 3.1217 3.7245 3.1736 3.2705 4.2453 6.6372 5.8921 7.5034 6.0135 6.7367 1.0889 1.0870 1.0890 1.0896 1.0898 1.0876 1.0953 1.0986 1.0972 1.0968 1.0659
irintensity: 0.1670 1.3079 3.0160 0.1425 1.8349 0.7840 2.8775 0.0308 3.5460 12.9234 135.0297 1.7509 1.6808 0.0148 8.3658 11.0879 0.0253 2.1937 15.7881 0.2144 0.9916 4.1843 12.2109 2.5343 1.3194 9.1362 5.4303 38.7102 0.0377 81.9709 40.7128 19.5882 27.6144 3.0261 17.0749 0.1578 0.1005 0.0020 3.1546 1.5809 0.1285 2.2837 1.9514 0.9867 9.3480 0.4608 2.5659 7.8543 245.1625 93.6826 3.6344 4.6835 9.5865 3.1224 3.2395 3.2018 4.6458 2.5914 5.3904 52.1170 0.5922 68.4772 37.2505 3.6205 9.1020 16.8982 45.1839 7.0232 4.6765 4.7426 2.3540 32.4088 130.6105 15.1645 8.7068 3.9534 14.4520 21.9046 4.9656 31.0102 29.3235 20.4350 13.4562 53.4759
temp: 298.150 k
press: 1.00000 atm
elementType: 8 7 6 6 6 6 6 6 6 6 6 6 6 6 6 6 6 6 6 1 1 1 1 1 1 1 1 1 1 1
symmnumber: 1
zpe: 602614.8 jmol-1
zpe.correction: 0.229524 hartree
zpe.thermalcorrener: 0.242960 hartree
zpe.thermalcorrenthalpy: 0.243904 hartree
zpe.thermalcorrgfe: 0.189721 hartree
zpe.sumelectzpe: -783.150759 hartree
zpe.sumelectthermal: -783.137323 hartree
zpe.sumelectthermalent: -783.136379 hartree
zpe.sumelectthermalfe: -783.190561 hartree
dipole: 1.3798 0.1976 0.0001
dipole: 1.3939
quadrupole: -105.3489 -85.9958 -116.4790
quadrupole: 10.7455 -0.0001 -0.0003
quadrupole: -2.7410 16.6121 -13.8711 10.7455 -0.0001 -0.0003
hfenergy: -783.3802828 hartree
pointgroup: C01 [X(C17H11N1O1)]
dipole: -0.5403012 0.0938802 -0.000025 debye
polarizability: 284.0086361|-5.6264796|266.6941324|0.004726|0.0025359|72.201458 unknown
InChI: InChI=1S/C17H11NO/c19-11-7-8-13-15-6-3-9-18-17(15)14-5-2-1-4-12(14)16(13)10-11/h1-10,19H
charge 0 multiplicity 1
30 atoms
O  -4.888054 0.167657 -0.000112
N  2.984627 -0.805667 0.000045
C  -1.126935 0.397624 -0.000068
C  -0.807149 -1.00338 -0.000082
C  -0.045359 1.400087 -0.000041
C  1.322938 0.970216 0.000009
C  0.593681 -1.438722 -0.000064
C  1.647832 -0.462418 0.000001
C  -2.497726 0.788979 -0.000075
C  -1.879493 -1.947819 -0.000104
C  -0.304218 2.80426 -0.00006
C  2.373698 1.932097 0.000056
C  0.987712 -2.810478 -0.000107
C  -3.525332 -0.167027 -0.000101
C  -3.218692 -1.55293 -0.000116
C  0.738877 3.742112 -0.000017
C  2.091108 3.304359 0.000046
C  2.346179 -3.156583 -0.000067
C  3.313952 -2.116159 0.000016
H  -2.764447 1.851544 -0.000051
H  -1.662859 -3.019598 -0.000105
H  -1.333283 3.17488 -0.000116
H  3.399913 1.555962 0.000095
H  0.236711 -3.605336 -0.000175
H  -4.037102 -2.278071 -0.00013
H  0.509139 4.81342 -0.000036
H  2.906221 4.035982 0.000085
H  2.66416 -4.203686 -0.000102
H  4.385664 -2.347202 0.00006
H  -5.013363 1.1491 -0.000085
