program: Gaussian 09
title: 000219950
version: EM64L-G09RevD.01
frameworkgroup: C1[X(C15H12O)]
method: RPBEPBE
basis: SDD
operation: Freq
keyword: #pfreq=noraman
keyword: PBEPBE/SDD
title: #p freq=noraman PBEPBE/SDD
converged: NO YES NO NO
title: Mulliken charges:
elementType: O C C C C C C C C C C C C C C C H H H H H H H H H H H H
charge: -0.441020 0.242701 0.223200 0.181640 0.319516 0.449992 -0.778371 -0.394252 -0.371504 -0.360120 -0.513495 -0.454644 -0.257185 -0.267307 -0.255493 -0.249473 0.239193 0.224545 0.292472 0.224787 0.223451 0.217584 0.244656 0.228293 0.229960 0.228708 0.230827 0.341338
chargesum: 0.00000
title: Mulliken charges with hydrogens summed into heavy atoms:
elementType: O C C C C C C C C C C C C C C C
charge: -0.099683 0.242701 0.223200 0.181640 0.319516 0.449992 -0.539178 -0.169707 -0.079031 -0.135333 -0.072459 -0.209987 -0.028892 -0.037347 -0.026785 -0.018646
polarizability: 2.54964907e+02 -1.80551822e+01 1.90529318e+02 4.75263087e+00 5.01252338e+00 7.24939136e+01
1716.lowfreq: -11.4197 -9.5308 -3.1761 -0.0005 -0.0005 -0.0005 68.4934 90.0033 108.5501
frequency: 68.4774 90.0005 108.5497 118.2524 211.1178 240.8219 243.6249 274.2528 335.0417 355.4125 401.4529 412.0685 431.1262 458.0396 502.8208 518.5783 543.7374 574.3053 612.4599 618.8531 677.3013 704.4588 737.8222 761.2220 767.6449 776.4999 808.5789 856.0513 866.4354 884.4549 908.9486 935.5620 958.2831 963.9116 985.4460 989.1165 991.3099 994.3338 1041.0735 1041.8207 1064.4432 1106.9054 1152.7630 1161.1214 1177.6522 1184.7701 1220.5938 1254.3537 1264.2266 1293.5082 1296.4420 1316.3423 1371.6162 1383.1845 1400.3999 1408.4505 1436.7491 1447.8212 1454.2867 1475.8441 1498.1956 1533.8130 1578.9496 1609.1630 1621.7326 1629.5691 2970.8888 3056.2398 3108.4937 3121.8686 3128.4225 3133.5988 3143.9786 3151.4387 3160.5973 3166.9458 3172.1802 3557.7415
redmass: 4.7843 3.7220 3.8153 4.3549 4.2906 4.0048 4.4095 2.1718 3.1906 1.5339 5.6593 3.9067 3.2213 4.4055 5.2199 3.0372 3.4471 3.8403 5.4183 4.8077 4.3062 5.2753 2.5743 1.4672 2.0576 2.6964 1.8555 4.7493 1.3952 1.7201 2.2780 2.5225 1.4481 1.4167 2.1293 1.5213 2.2425 1.9123 2.3747 2.7273 2.6203 2.2859 1.4282 1.1142 1.0711 1.1019 1.3823 2.2680 1.8570 1.2568 1.7574 2.2078 1.3877 2.5434 5.7733 2.8455 2.4295 2.4355 3.3390 1.1042 3.2049 3.8499 7.5158 5.8027 6.3859 6.7908 1.0665 1.0968 1.0912 1.0864 1.0855 1.0885 1.0907 1.0937 1.0962 1.0977 1.0985 1.0664
irintensity: 0.8068 0.2219 0.7803 3.0246 5.1246 0.9653 0.0806 20.9356 18.5377 148.6788 4.3250 2.7812 9.5956 1.1298 5.9116 1.6090 5.4877 2.8459 1.6874 4.6084 2.6469 1.5806 47.5250 54.8631 15.2698 49.1277 0.4343 5.1964 14.2580 4.3457 72.9178 31.4096 1.3046 6.6840 3.2398 0.1065 0.9240 1.3092 0.8883 12.1420 14.1342 6.9934 4.7353 20.3814 0.5973 0.6678 7.0450 5.9204 7.3411 20.4487 0.6608 1.4513 37.0537 6.5084 0.1013 0.9857 11.5598 14.0119 0.4794 9.5299 11.1437 3.9747 0.0270 1.6879 0.3689 0.0977 63.0725 18.8178 13.5712 5.9036 0.7687 10.7260 23.8047 6.6986 24.4182 42.0978 18.1779 7.1831
temp: 298.150 k
press: 1.00000 atm
elementType: 8 6 6 6 6 6 6 6 6 6 6 6 6 6 6 6 1 1 1 1 1 1 1 1 1 1 1 1
symmnumber: 1
zpe: 586077.8 jmol-1
zpe.correction: 0.223225 hartree
zpe.thermalcorrener: 0.235535 hartree
zpe.thermalcorrenthalpy: 0.236479 hartree
zpe.thermalcorrgfe: 0.184811 hartree
zpe.sumelectzpe: -652.940199 hartree
zpe.sumelectthermal: -652.927889 hartree
zpe.sumelectthermalent: -652.926945 hartree
zpe.sumelectthermalfe: -652.978613 hartree
dipole: 1.8934 0.1602 0.1839
dipole: 1.9090
quadrupole: -90.8116 -80.6973 -96.6367
quadrupole: -4.7935 1.6977 0.5208
quadrupole: -1.4298 8.6846 -7.2548 -4.7935 1.6977 0.5208
hfenergy: -653.163424 hartree
pointgroup: C01 [X(C15H12O1)]
dipole: -0.7343444 -0.1440471 0.0639825 debye
polarizability: 258.2652144|-10.3516605|186.8180484|-0.4944448|-9.4728415|72.9048756 unknown
InChI: InChI=1S/C15H12O/c16-10-12-9-11-5-1-2-6-13(11)15-8-4-3-7-14(12)15/h1-9,16H,10H2
charge 0 multiplicity 1
28 atoms
O  2.88828 2.681748 0.698099
C  0.251941 -0.944392 0.014237
C  1.278075 0.065316 -0.107197
C  -1.160781 -0.550499 0.007972
C  0.902676 1.467578 -0.254035
C  -1.49386 0.846112 -0.124948
C  -0.437591 1.820263 -0.257981
C  0.658253 -2.308949 0.135107
C  2.654194 -0.32686 -0.084971
C  -2.234407 -1.485126 0.128855
C  1.953551 2.54711 -0.44158
C  -2.863506 1.254234 -0.133901
C  2.011453 -2.67205 0.141493
C  3.018859 -1.673359 0.032865
C  -3.572416 -1.065726 0.118788
C  -3.894289 0.31517 -0.013881
H  -0.720624 2.875262 -0.371552
H  -0.095108 -3.097239 0.224656
H  3.424978 0.44725 -0.13331
H  -2.02267 -2.553409 0.233247
H  2.618502 2.316706 -1.292294
H  1.455181 3.516684 -0.644877
H  -3.095663 2.320846 -0.238807
H  2.29353 -3.726479 0.235904
H  4.076685 -1.957631 0.049059
H  -4.375359 -1.805071 0.213431
H  -4.941542 0.635785 -0.022169
H  2.359758 2.738527 1.53459
