program: Gaussian 09
title: 000219941
version: EM64L-G09RevD.01
frameworkgroup: C1[X(C17H18O4)]
method: RPBEPBE
basis: SDD
operation: Freq
keyword: #pfreq=noraman
keyword: PBEPBE/SDD
title: #p freq=noraman PBEPBE/SDD
converged: YES YES NO NO
title: Mulliken charges:
elementType: O O O O C C C C C C C C C C C C C C C C C H H H H H H H H H H H H H H H H H H
charge: -0.262638 -0.220386 -0.267087 -0.248315 0.261070 0.235724 0.183103 -0.542315 0.059852 0.163509 -0.403323 -0.512225 -0.380643 -0.396293 -0.393885 -0.263408 -0.235832 0.256351 -0.262614 -0.531777 -0.663966 0.264272 0.275730 0.267999 0.244313 0.286257 0.246491 0.246648 0.275238 0.230288 0.232493 0.222867 0.233452 0.247975 0.227731 0.228196 0.216568 0.250263 0.228315
chargesum: 0.00000
title: Mulliken charges with hydrogens summed into heavy atoms:
elementType: O O O O C C C C C C C C C C C C C C C C C
charge: -0.262638 -0.220386 -0.267087 -0.248315 0.261070 0.235724 0.183103 -0.002313 0.059852 0.163509 -0.135324 0.018345 -0.134152 -0.149645 -0.118647 -0.033119 -0.003338 0.256351 0.193705 0.172126 0.031180
polarizability: 2.92140843e+02 5.05532700e+00 2.20249464e+02 -2.10436708e+01 9.20746420e-02 1.17796031e+02
1716.lowfreq: -0.0006 -0.0005 0.0006 0.6334 4.5407 9.9874 13.8914 23.3376 28.7855
frequency: 13.6517 23.2686 28.7452 58.1314 65.5593 83.6278 93.2049 112.5869 129.7041 141.8965 167.3141 189.6974 198.0507 211.9339 216.8629 237.1211 278.5214 312.5618 323.9070 341.0622 358.7740 400.4685 426.3858 456.9886 464.7783 472.8585 510.3739 545.4897 570.9104 590.5797 624.8325 639.6327 649.2615 665.4121 697.9661 743.1975 777.2281 784.6371 784.9687 802.1950 811.7891 819.0261 828.9629 886.5335 908.2267 921.7188 952.8625 971.4126 974.1091 998.5563 1006.8751 1010.9861 1033.1646 1057.2410 1073.3826 1085.6363 1095.3091 1114.7443 1126.1613 1150.3038 1156.0760 1157.5874 1170.0421 1179.8396 1199.0116 1238.8623 1244.5481 1245.9508 1278.4077 1281.3434 1316.4142 1346.4599 1358.9134 1363.7273 1385.3378 1390.6926 1415.0356 1434.0038 1439.2188 1443.0720 1456.8538 1458.0425 1463.5326 1465.8230 1468.7756 1474.0863 1484.5769 1520.3483 1554.1561 1579.1300 1594.2817 1626.2683 1638.0051 2969.6767 2985.7721 2990.9364 2992.8457 3028.5341 3058.8160 3062.0395 3088.0914 3089.6602 3092.3817 3118.4948 3131.8288 3131.9482 3149.0739 3149.1047 3165.3129 3172.6569 3177.6979
redmass: 4.8293 5.0153 4.1559 4.0197 3.7492 5.1429 3.5864 3.2473 3.2607 3.9070 4.4304 3.4017 3.6579 3.3365 1.4458 1.2819 2.5454 4.1548 4.6425 4.7493 3.7284 4.2489 3.2585 3.8275 5.5069 3.4128 5.2417 3.8624 3.3242 4.0689 4.2242 3.5775 4.1352 3.7448 5.5968 3.4469 1.6008 3.3148 1.5219 2.4409 2.1709 2.3340 1.5005 1.5949 3.8071 4.0940 1.8463 1.9503 2.0713 1.3554 2.0921 3.0025 2.5438 3.7299 3.1913 2.7276 2.1913 1.2587 2.4251 1.4438 1.6816 1.5434 1.4215 1.1097 1.4536 1.3168 2.1008 2.0342 1.1199 1.6938 1.5426 1.6562 1.8692 2.5436 2.2333 1.2324 9.3264 1.6654 1.7107 1.0930 1.0926 2.1031 1.0443 1.1119 1.0496 1.1046 1.0510 3.9302 7.9213 6.0986 7.4793 6.6490 8.9144 1.0324 1.0654 1.0647 1.0363 1.0595 1.0948 1.1043 1.0974 1.0940 1.1033 1.1059 1.0940 1.0921 1.0899 1.0888 1.0953 1.0945 1.0978
irintensity: 0.9026 1.4980 0.2917 0.5731 0.6349 2.6022 4.8344 4.7370 4.4718 3.6884 0.9154 2.1154 8.8717 1.6295 5.0313 1.7010 4.2076 22.7199 6.2908 4.0215 2.8419 5.7782 3.5700 2.1792 8.7220 0.1954 3.0152 31.2928 7.9800 16.8517 2.9057 2.8592 3.8409 8.9660 12.3888 4.1716 66.2341 20.0117 18.7865 1.7408 1.9227 11.4182 41.2089 0.4905 6.4644 9.1881 12.6338 3.0455 5.9357 0.3247 13.4506 79.8528 11.1156 15.3790 157.8113 14.7069 50.2203 0.1145 303.4726 8.9503 21.9560 12.7937 79.3287 0.2356 17.5963 37.7875 88.8319 269.2354 2.7024 4.3826 198.7141 4.9588 41.3162 13.2748 10.7034 23.3270 5.1425 15.7235 7.3027 21.1493 12.3158 27.3511 13.6287 43.7286 15.1898 36.6335 13.2092 82.0386 214.3407 110.5299 42.4923 6.2775 144.2332 72.3470 0.1719 41.7266 17.5149 30.2990 9.0258 39.5196 35.0308 14.8112 0.4650 34.2588 6.1310 16.4958 11.8475 5.2817 19.1759 14.5449 13.3381
temp: 298.150 k
press: 1.00000 atm
elementType: 8 8 8 8 6 6 6 6 6 6 6 6 6 6 6 6 6 6 6 6 6 1 1 1 1 1 1 1 1 1 1 1 1 1 1 1 1 1 1
symmnumber: 1
zpe: 815881.0 jmol-1
zpe.correction: 0.310753 hartree
zpe.thermalcorrener: 0.331061 hartree
zpe.thermalcorrenthalpy: 0.332006 hartree
zpe.thermalcorrgfe: 0.258961 hartree
zpe.sumelectzpe: -957.973738 hartree
zpe.sumelectthermal: -957.953429 hartree
zpe.sumelectthermalent: -957.952485 hartree
zpe.sumelectthermalfe: -958.025530 hartree
dipole: -2.5346 1.5149 0.6908
dipole: 3.0326
quadrupole: -82.3255 -116.7719 -133.4915
quadrupole: 15.8981 -6.5917 -4.4371
quadrupole: 28.5374 -5.9089 -22.6285 15.8981 -6.5917 -4.4371
hfenergy: -958.2844909 hartree
pointgroup: C01 [X(C17H18O4)]
dipole: 1.0229503 0.4834081 -0.3786453 debye
polarizability: 291.7615222|-12.2292072|216.470384|-18.0685085|-20.7323408|121.9544325 unknown
InChI: InChI=1S/C17H18O4/c1-3-21-17(19)11-9-15(18)13-8-10-16(20-2)14-7-5-4-6-12(13)14/h4-8,10H,3,9,11H2,1-2H3
charge 0 multiplicity 1
39 atoms
O  5.013541 -0.397291 -0.370786
O  -0.928831 -1.831742 1.761157
O  -5.057137 0.934133 0.206934
O  -4.243624 -0.561157 -1.391203
C  1.447666 0.522468 0.225745
C  0.890093 -0.762165 0.603646
C  2.85671 0.611365 -0.100351
C  -1.622081 -0.478675 -0.122544
C  -0.565204 -1.03107 0.845054
C  3.676065 -0.576385 -0.012672
C  1.748919 -1.866513 0.732658
C  -2.897526 -0.020899 0.613269
C  0.692212 1.74389 0.2337
C  3.132208 -1.793225 0.421836
C  3.430693 1.868918 -0.470353
C  1.274804 2.963637 -0.120979
C  2.651238 3.027731 -0.493297
C  -4.096591 0.062495 -0.313571
C  -6.338839 1.051038 -0.557953
C  5.909219 -1.55591 -0.283091
C  -7.31571 -0.055276 -0.15019
H  -1.219441 0.305326 -0.782024
H  -1.898659 -1.323645 -0.786734
H  1.317651 -2.81827 1.059969
H  -2.765961 0.948781 1.125046
H  -3.124427 -0.765026 1.403445
H  -0.351193 1.729627 0.561557
H  3.747345 -2.692433 0.51085
H  4.494726 1.900839 -0.719303
H  0.674237 3.879681 -0.100664
H  3.097232 3.987501 -0.774832
H  -6.709922 2.052532 -0.287506
H  -6.108312 1.006187 -1.637014
H  6.890486 -1.183667 -0.610555
H  5.572683 -2.369887 -0.952892
H  5.976028 -1.928951 0.756459
H  -8.283983 0.093725 -0.663389
H  -6.925074 -1.046632 -0.434742
H  -7.496043 -0.039955 0.938521
