program: Gaussian 09
title: 000219920
version: EM64L-G09RevD.01
frameworkgroup: C1[X(C6H11Cl2NO)]
method: RPBEPBE
basis: SDD
operation: Freq
keyword: #p
keyword: freq=noraman
keyword: PBEPBE/SDD
title: #p freq=noraman PBEPBE/SDD
converged: YES YES NO NO
title: Mulliken charges:
elementType: Cl Cl O N C C C C C C H H H H H H H H H H H
charge: -0.001115 0.027734 -0.241190 -0.314224 -0.331379 -0.396757 -0.352142 -0.683258 0.365580 -0.694565 0.225335 0.200725 0.215141 0.258565 0.189532 0.206244 0.323858 0.216292 0.218460 0.208849 0.358314
chargesum: 0.00000
title: Mulliken charges with hydrogens summed into heavy atoms:
elementType: Cl Cl O N C C C C C C
charge: -0.001115 0.027734 -0.241190 0.009635 0.094681 0.076950 0.043634 -0.039657 0.365580 -0.336251
polarizability: 1.00577209e+02 -3.42809588e-03 8.94649298e+01 -2.85794326e+00 1.10842006e+00 9.03019418e+01
1716.lowfreq: -16.4239 -5.9943 -0.0020 -0.0011 0.0016 11.1931 12.7130 32.9576 34.8242
frequency: 6.3226 32.5194 34.6716 76.9274 107.5950 163.0082 185.0356 221.8365 232.7823 250.1301 287.3824 350.4900 381.5909 494.0859 574.3332 604.1568 637.8698 680.4427 735.9479 748.3992 802.4223 847.5865 887.2319 971.3017 974.9578 1048.4661 1100.1842 1118.9524 1139.5139 1184.9150 1199.0994 1229.6190 1243.0338 1269.0395 1289.3762 1313.0227 1349.0393 1367.0392 1391.8296 1457.2528 1458.6876 1474.0972 1478.2376 1486.0415 1504.6410 1628.2046 2960.8721 2975.6117 2981.1559 3003.3035 3009.0895 3047.2543 3072.7337 3076.7009 3080.0207 3164.2358 3534.1984
redmass: 5.2656 6.9991 6.6847 1.6084 3.5575 4.9686 5.0220 7.4582 1.2112 4.1405 2.7501 3.3330 9.3025 2.3367 1.6682 2.9382 4.8962 5.0993 1.3462 4.7945 1.7781 2.1391 1.6906 1.5896 2.1000 3.0753 3.6224 2.1191 1.9041 1.0779 1.2583 1.3249 1.8097 1.4532 1.1042 1.2269 1.4486 1.3596 1.2117 1.0898 1.0894 1.0620 1.0429 1.0785 1.8295 8.0808 1.0595 1.0367 1.0604 1.0695 1.0925 1.1006 1.1007 1.0996 1.1025 1.0897 1.0779
irintensity: 1.0834 6.6193 1.1243 0.0054 0.5721 4.6389 1.8742 1.8444 0.0547 5.8660 3.2171 11.2378 7.3052 11.3638 8.6994 162.5655 42.3818 68.5302 25.2700 29.5710 5.1356 2.0727 3.1957 13.6030 0.6567 2.6775 7.7572 6.1927 1.1478 13.5331 9.6240 4.4019 9.2948 34.3950 0.1381 15.0221 0.9194 2.9588 10.2076 23.1919 10.3795 6.0033 11.0080 15.7107 153.1557 225.0734 28.5799 26.5317 44.2600 31.0800 3.3218 36.4410 71.4625 38.3356 20.9724 0.6325 31.7615
temp: 298.150 k
press: 1.00000 atm
elementType: 17 17 8 7 6 6 6 6 6 6 1 1 1 1 1 1 1 1 1 1 1
symmnumber: 1
zpe: 436185.4 jmol-1
zpe.correction: 0.166134 hartree
zpe.thermalcorrener: 0.178548 hartree
zpe.thermalcorrenthalpy: 0.179492 hartree
zpe.thermalcorrgfe: 0.123094 hartree
zpe.sumelectzpe: -1284.534799 hartree
zpe.sumelectthermal: -1284.522385 hartree
zpe.sumelectthermalent: -1284.521441 hartree
zpe.sumelectthermalfe: -1284.577839 hartree
dipole: -2.1608 -0.2369 -2.3717
dipole: 3.2172
quadrupole: -71.2593 -77.2312 -79.3939
quadrupole: 1.0550 2.0695 3.8906
quadrupole: 4.7021 -1.2697 -3.4324 1.0550 2.0695 3.8906
hfenergy: -1284.7009331 hartree
pointgroup: C01 [X(C6H11Cl2N1O1)]
dipole: -1.0333175 0.0423416 -0.7297436 debye
dipolederiv: -0.25622 -0.0607507 0.1110003 -0.083051 -0.1801528 0.0637299 0.3082599 0.037165 -0.7605419 -0.1948941 0.0411248 0.0854774 -0.0789769 -0.5561936 -0.2772945 0.0109958 -0.2108329 -0.2901552 -0.6652266 -0.1279465 -0.0043627 0.1710461 -0.6027034 0.3304827 -0.4108447 0.2203238 -0.6234775 -1.130072 -0.0237422 -0.1511483 -0.0389878 -0.4076836 -0.0542225 -0.2483893 -0.0431969 -0.5158429 0.0486793 0.0504888 0.0251723 0.0011982 0.0470716 -0.0438669 0.0317616 -0.0238762 0.038115 0.4931901 0.0955583 -0.0451666 0.3061532 0.2224796 0.0953868 -0.1004821 0.0416911 0.2413441 0.0940299 0.0491378 0.0657289 0.051402 0.0660723 0.0078176 0.0948939 0.0186244 0.0989676 0.0150287 0.0595474 0.0398027 0.074463 0.0387089 -0.0296036 0.0170067 -0.0181147 0.0492683 1.214513 0.2533222 0.2949117 -0.0969116 0.5435275 -0.4179214 0.8513101 -0.3058793 0.5790805 0.2971777 -0.0906354 -0.2222733 0.0145375 0.6689552 0.2784623 -0.3527885 0.2441078 1.152079 0.040791 0.0116931 -0.0891307 0.0131175 0.0322631 -0.0566528 -0.0702818 -0.02808 -0.0895676 -0.1230241 -0.1299011 0.0466734 -0.0803074 -0.0506567 0.0423051 0.0504808 0.0361986 0.0781462 -0.0334123 -0.0621981 -0.0566793 -0.0625708 0.0850901 -0.0228516 -0.0502811 -0.0876279 -0.1134034 0.0184865 0.1043239 -0.0124412 0.0159513 -0.0355848 0.0127299 0.0244929 0.0770766 0.0778849 0.0253926 0.0111035 -0.0716774 -0.0074971 0.0285344 -0.082157 -0.0790495 -0.0458611 -0.1722156 -0.0809342 -0.1145468 0.0610299 -0.117427 -0.0419119 0.0402829 0.0415824 0.0312388 0.0418424 0.2488387 -0.0269813 -0.0477384 -0.0882393 0.196935 0.0686325 -0.0682507 0.0608259 0.2363307 0.0361283 -0.0284722 -0.1057296 -0.0125624 0.0792601 -0.0456507 -0.0484469 -0.0744329 -0.1234914 0.0172866 0.1017856 -0.0154012 0.1399932 -0.1121148 0.0676022 -0.0371737 0.0948094 0.0446484 -0.0755717 -0.0931888 0.0521901 -0.1572018 -0.0270443 0.0310257 0.0506893 0.001543 0.0721377 0.0098127 -0.0197221 0.0397622 0.0358711 0.0051483 -0.0082365 -0.0154851 -0.0257025 -0.0211494 unknown
polarizability: 98.7713839|1.7864204|89.2370011|-4.5623207|0.1743103|92.335696 unknown
InChI: InChI=1S/C6H11Cl2NO/c1-2-3-4-9-6(10)5(7)8/h5,9H,2-4H2,1H3
charge 0 multiplicity 1
21 atoms
Cl 2.489536 0.592034 -2.255747
Cl 1.867223 1.984213 0.415703
O  1.273281 -1.463963 0.876362
N  -0.0268 -0.570624 -0.855211
C  -2.257275 -0.682803 0.313463
C  -1.219824 -1.396609 -0.585664
C  -2.847808 0.601559 -0.31028
C  -3.921945 1.252854 0.587574
C  1.101946 -0.656632 -0.086779
C  2.229598 0.337204 -0.406392
H  -1.785248 -0.44719 1.286883
H  -3.07539 -1.401728 0.522283
H  -1.6773 -1.668105 -1.555812
H  -0.870389 -2.321473 -0.094714
H  -3.289334 0.360293 -1.299752
H  -2.034224 1.332278 -0.492941
H  -0.041063 0.099311 -1.627849
H  -3.498966 1.530117 1.571125
H  -4.333233 2.168986 0.126126
H  -4.763018 0.557193 0.767781
H  3.181935 -0.015414 0.00444
