program: Gaussian 09
title: 000219913
version: EM64L-G09RevD.01
frameworkgroup: C1[X(C8H16INO)]
method: RPBEPBE
basis: SDD
operation: Freq
keyword: #p
keyword: freq=noraman
keyword: PBEPBE/SDD
title: #p freq=noraman PBEPBE/SDD
converged: YES YES NO NO
title: Mulliken charges:
elementType: I O N C C C C C C C C H H H H H H H H H H H H H H H H
charge: 0.008981 -0.259844 -0.333692 -0.366766 -0.361614 -0.343284 -0.354339 -0.404840 -0.693042 0.299308 -0.815532 0.199977 0.184648 0.226998 0.202541 0.192389 0.185935 0.213024 0.256942 0.195808 0.193799 0.209721 0.211065 0.216561 0.306567 0.315383 0.313309
chargesum: 0.00000
title: Mulliken charges with hydrogens summed into heavy atoms:
elementType: I O N C C C C C C C C
charge: 0.008981 -0.259844 -0.027126 0.017859 0.067925 0.035040 0.035268 0.065125 -0.055696 0.299308 -0.186840
polarizability: 1.28504459e+02 1.10426292e+01 1.37233866e+02 -5.40595714e+00 1.37866327e+01 9.26351669e+01
1716.lowfreq: -13.7203 -10.1171 0.0004 0.0005 0.0005 4.7134 8.8582 23.6203 51.6353
frequency: -9.6698 23.3274 51.4445 55.8652 83.2013 96.1826 125.0292 142.1878 151.3207 213.6152 230.7909 271.7112 322.4195 350.2057 397.9162 487.2981 555.2054 583.6090 607.8471 628.2014 724.9315 746.2560 798.7862 835.2264 851.2488 884.6709 908.1124 941.0942 996.7092 1029.5438 1060.9758 1078.3750 1101.4526 1120.9229 1133.7535 1143.3916 1198.9628 1202.2098 1229.7148 1251.9255 1258.2377 1283.4504 1289.0994 1293.1205 1316.2095 1348.7842 1351.7998 1366.6545 1390.0993 1408.3097 1453.5122 1458.5635 1464.6271 1470.8376 1477.3578 1480.4250 1488.4839 1506.2934 1600.8869 2948.8964 2956.1927 2967.5394 2972.8112 2977.9304 2988.6253 3000.1774 3004.9898 3029.0378 3047.0499 3068.4283 3069.0624 3072.4023 3074.8484 3150.2979 3508.2980
redmass: 5.7770 4.9292 1.6678 3.0988 2.8304 4.2479 1.8176 2.6671 3.2675 4.3450 1.1164 4.3223 2.8501 3.9427 2.9361 2.3228 3.3287 3.7825 3.9579 1.1544 1.0815 1.2309 1.5753 1.7413 1.5654 2.1875 2.3134 1.6664 1.5580 2.9748 2.4712 2.3917 3.2810 2.3939 1.2983 1.6044 1.2094 1.5089 1.3455 1.6960 1.3286 1.3059 1.0477 1.1475 1.2808 1.4677 1.5645 1.3391 1.2163 1.1006 1.1037 1.0812 1.0693 1.0748 1.0432 1.0743 1.0884 1.9452 7.7399 1.0588 1.0590 1.0595 1.0364 1.0623 1.0954 1.0679 1.0961 1.1030 1.1012 1.0567 1.1007 1.0993 1.1028 1.1081 1.0781
irintensity: 0.3106 1.8592 2.0116 9.2071 3.0604 0.4545 0.4381 2.3303 5.4676 1.5468 0.0082 0.1429 4.2200 10.6314 1.2224 2.7062 16.5510 52.6906 42.1165 102.4485 15.1060 1.8254 9.7776 21.1739 1.4665 4.9116 0.9575 1.0354 1.4538 2.7596 10.6740 2.6534 3.4415 4.3988 0.5496 1.5593 36.2195 2.2642 4.1247 18.9554 9.5882 32.7584 0.2183 6.2081 17.4548 1.3753 0.5279 5.4188 12.1382 31.6652 27.4243 3.5425 0.9137 1.1669 11.8126 6.6572 22.0455 235.7450 196.3126 7.8368 8.6172 69.4806 34.2520 52.6914 7.0548 28.6245 2.2657 19.0484 92.4382 1.1587 90.4735 50.1874 13.5529 0.0249 50.5427
temp: 298.150 k
press: 1.00000 atm
elementType: 53 8 7 6 6 6 6 6 6 6 6 1 1 1 1 1 1 1 1 1 1 1 1 1 1 1 1
symmnumber: 1
zpe: 605065.1 jmol-1
zpe.correction: 0.230457 hartree
zpe.thermalcorrener: 0.243790 hartree
zpe.thermalcorrenthalpy: 0.244734 hartree
zpe.thermalcorrgfe: 0.186935 hartree
zpe.sumelectzpe: -455.046563 hartree
zpe.sumelectthermal: -455.033230 hartree
zpe.sumelectthermalent: -455.032286 hartree
zpe.sumelectthermalfe: -455.090086 hartree
dipole: 1.7045 -1.3285 -1.5949
dipole: 2.6859
quadrupole: -82.3270 -93.6523 -82.4660
quadrupole: 1.8117 -2.0948 -4.8525
quadrupole: 3.8214 -7.5038 3.6825 1.8117 -2.0948 -4.8525
hfenergy: -455.2770206 hartree
pointgroup: C01 [X(C8H16I1N1O1)]
dipole: -0.8741076 0.0671682 0.5899719 debye
polarizability: 123.8107391|-6.9364868|120.5905975|-4.1055748|-28.4560182|113.9721551 unknown
InChI: InChI=1S/C8H16INO/c1-2-3-4-5-6-10-8(11)7-9/h10H,2-7H2,1H3
charge 0 multiplicity 1
27 atoms
I  2.914471 -2.297252 2.0545
O  2.992444 0.887365 -1.023649
N  1.587532 0.545476 0.809616
C  -1.519359 0.508793 0.437841
C  -0.513157 1.446129 -0.266128
C  -2.796701 0.26304 -0.396567
C  -3.814078 -0.667541 0.302542
C  0.759592 1.742195 0.561004
C  -5.086148 -0.907636 -0.538812
C  2.630998 0.209223 -0.007842
C  3.453912 -1.049607 0.278883
H  -1.034776 -0.467062 0.650205
H  -1.802824 0.942384 1.420752
H  -0.210975 1.016206 -1.240783
H  -1.005811 2.41516 -0.486422
H  -2.515178 -0.173358 -1.377524
H  -3.283969 1.23571 -0.61823
H  0.48525 2.179662 1.539856
H  1.394675 2.466103 0.020772
H  -3.326552 -1.638996 0.524059
H  -4.094216 -0.22992 1.282673
H  -5.609337 0.044665 -0.747808
H  -4.835964 -1.372255 -1.511257
H  -5.796377 -1.575778 -0.018009
H  1.362246 -0.070273 1.595408
H  4.504898 -0.768003 0.441145
H  3.383205 -1.73653 -0.577522
