program: Gaussian 09
title: 000219909
version: EM64L-G09RevD.01
frameworkgroup: C1[X(C6H9Cl4NO2)]
method: RPBEPBE
basis: SDD
operation: Freq
keyword: #p
keyword: freq=noraman
keyword: PBEPBE/SDD
title: #p freq=noraman PBEPBE/SDD
converged: YES YES NO NO
title: Mulliken charges:
elementType: Cl Cl Cl Cl O O N C C C C C C H H H H H H H H H
charge: 0.078287 0.036476 -0.034557 -0.064604 -0.376759 -0.252123 -0.342833 -0.405326 -0.045090 -0.278509 -0.613166 0.320161 -0.669338 0.305291 0.303618 0.339600 0.241783 0.234342 0.251436 0.370543 0.302509 0.298258
chargesum: 0.00000
title: Mulliken charges with hydrogens summed into heavy atoms:
elementType: Cl Cl Cl Cl O O N C C C C C C
charge: 0.078287 0.036476 -0.034557 -0.064604 -0.006216 -0.252123 -0.003233 -0.405326 0.260201 0.025109 0.114395 0.320161 -0.068570
polarizability: 1.23232196e+02 4.05875999e+00 1.21600656e+02 -6.33665478e+00 1.66160327e+01 1.02912093e+02
1716.lowfreq: -6.3960 0.0021 0.0037 0.0041 5.8823 8.7984 25.9300 37.3423 49.4197
frequency: 25.8606 37.2896 49.3965 77.5762 84.7181 123.5733 148.2646 169.3043 185.3514 201.7318 222.9205 233.5217 242.9392 247.0023 296.5466 313.8449 338.7883 385.2613 415.4510 480.3092 531.7415 554.9846 580.6574 614.4724 644.7645 689.5619 716.0716 751.5806 909.3458 915.2414 936.7828 984.6062 1010.2531 1036.5841 1083.5221 1112.7852 1153.7886 1159.3413 1216.3628 1223.5737 1224.0968 1259.0893 1313.7205 1331.6159 1383.1695 1394.7650 1418.4657 1461.9299 1469.8754 1476.9647 1604.5988 3007.4593 3041.9371 3070.6403 3084.1290 3105.9375 3126.9478 3151.4704 3477.0279 3583.7710
redmass: 13.0826 8.4670 8.4251 6.9626 3.0674 9.9378 9.2871 6.3335 8.6222 11.6120 1.4819 5.4496 1.4669 2.1264 4.4919 7.3212 8.7253 5.5394 6.4611 3.8785 4.6992 4.9904 3.7661 4.3077 3.5894 5.9898 1.4453 4.5041 1.7645 2.5372 6.8377 2.8625 2.4450 2.7855 3.2459 2.6950 1.1355 3.0574 1.1841 1.3104 1.4489 1.1913 1.3667 1.5668 1.2986 1.2005 1.0916 1.0457 1.0476 1.9783 8.7294 1.0361 1.0842 1.0568 1.0866 1.0986 1.1004 1.1089 1.0775 1.0669
irintensity: 0.1488 0.6506 2.2174 5.0139 10.8539 2.3564 2.2079 3.1217 2.0429 0.6547 1.1677 1.7648 101.6892 44.2161 0.6718 5.9719 0.3988 5.5362 22.0536 14.3345 35.7504 16.6021 9.3943 53.5114 1.1883 108.8608 101.6350 68.2887 6.4406 88.5349 16.8689 27.0989 66.6386 41.1320 33.0722 11.5824 0.8314 12.5490 7.1459 9.3720 24.1719 18.5403 3.6421 60.4305 5.1172 28.5944 48.6664 10.1823 11.5543 384.8958 162.8448 8.7672 11.0814 2.3875 1.9267 8.7127 8.0854 0.4057 50.4835 25.6261
temp: 298.150 k
press: 1.00000 atm
elementType: 17 17 17 17 8 8 7 6 6 6 6 6 6 1 1 1 1 1 1 1 1 1
symmnumber: 1
zpe: 395325.6 jmol-1
zpe.correction: 0.150572 hartree
zpe.thermalcorrener: 0.166337 hartree
zpe.thermalcorrenthalpy: 0.167281 hartree
zpe.thermalcorrgfe: 0.105149 hartree
zpe.sumelectzpe: -2278.458561 hartree
zpe.sumelectthermal: -2278.442796 hartree
zpe.sumelectthermalent: -2278.441852 hartree
zpe.sumelectthermalfe: -2278.503983 hartree
dipole: 1.1283 -0.1822 -1.3640
dipole: 1.7796
quadrupole: -101.8614 -115.9089 -99.4663
quadrupole: -0.5392 4.7150 -1.7374
quadrupole: 3.8841 -10.1634 6.2792 -0.5392 4.7150 -1.7374
hfenergy: -2278.6091325 hartree
pointgroup: C01[X(C6H9Cl4N1O2)]
dipole: -0.3357068 -0.4830999 -0.3796243 debye
dipolederiv: -0.4941031 -0.1945304 -0.1956842 -0.1593904 -0.2366786 -0.1047417 -0.1887227 -0.1192375 -0.248195 -0.2380357 -0.0094613 0.0375224 -0.0026154 -0.1982454 0.0794634 0.0280138 0.0508485 -0.6981377 -0.2367063 0.0186094 0.1206149 0.0243168 -0.260347 0.1181741 0.1731223 0.1036583 -0.5104317 -0.2435207 -0.0155858 0.0122713 -0.0834315 -0.2187029 -0.1389055 -0.155558 -0.1779503 -0.5407846 -0.5066665 0.0036807 -0.1977557 -0.1678859 -0.9156527 0.0290176 -0.2142122 0.1303039 -0.2235151 -0.7373278 -0.110059 -0.0789898 0.020022 -0.4225038 -0.2401716 0.37837 -0.112659 -0.8307359 -1.5849185 -0.2454638 0.1584302 -0.0274781 -0.6088502 0.0037651 0.1182537 -0.0783425 -0.4134885 0.7115784 0.2685245 0.1854239 0.2010125 0.4200166 0.001406 0.2343641 0.0952179 0.9802386 0.8529341 0.1282951 0.0703889 0.1657144 0.9120089 0.0094727 0.3929383 0.0186977 0.0198533 0.1527722 -0.0669717 -0.2025116 -0.0285104 0.2091489 -0.1461773 -0.2245051 -0.2055722 0.5788243 -0.1010706 0.0619893 0.0385291 0.0973844 -0.0677055 0.0327964 0.05407 0.0204143 -0.0717152 1.5329837 0.2956272 -0.0434381 0.1576872 0.3139167 0.2366521 -0.7461027 0.0790893 0.8280693 -0.081753 -0.1336075 -0.1663754 -0.0539482 0.1790445 0.1332752 0.0912304 0.2001226 0.6706498 0.0979416 -0.0086291 0.0595062 -0.0199338 0.0386103 0.0054555 -0.075696 0.0330977 0.0281865 -0.0051133 -0.031901 -0.0188193 -0.0764411 0.0379501 0.0205471 -0.0339579 0.01828 -0.0426325 0.3405563 -0.0149183 0.0789417 -0.060886 0.3015899 0.0075463 0.0471198 -0.0073397 0.2040037 0.0806598 -0.0317899 0.0124326 0.0053417 -0.1047121 0.0259671 -0.0013937 0.0486289 0.1141318 0.0749243 0.0024603 0.0477903 -0.0087713 0.1308796 0.0302088 0.05697 0.0100725 -0.0689081 0.0128641 -0.0141385 -0.0442809 -0.0671943 0.0928639 -0.0692282 -0.0908549 -0.0319603 0.049261 0.2293417 0.0716252 0.1345011 0.0509686 0.3283919 0.00216 0.1432142 -0.0471572 0.202416 0.1105426 -0.0193318 0.0058133 -0.0487809 0.0177038 -0.0064066 0.0190463 0.0258007 -0.029006 0.0321168 0.0455763 -0.0143108 0.0828196 0.0512731 -0.0302764 -0.0057096 -0.054014 0.001916 unknown
polarizability: 123.4584435|7.7927015|94.5118067|-3.1767061|5.9856293|129.7746944 unknown
InChI: InChI=1S/C6H9Cl4NO2/c1-3(8)6(9,10)5(13)11-4(12)2-7/h3,5,11,13H,2H2,1H3
charge 0 multiplicity 1
22 atoms
Cl 2.935978 1.139018 0.584239
Cl 1.751815 0.470793 -2.155021
Cl 1.01612 -1.506536 1.82934
Cl -2.972355 -0.899384 -2.358337
O  0.345714 2.428431 -0.297609
O  -2.316773 0.640676 1.350949
N  -0.943207 0.394058 -0.524591
C  1.513239 0.300068 -0.268265
C  0.204888 1.04238 0.109141
C  1.514982 -1.219704 0.005043
C  2.828549 -1.955671 -0.245709
C  -2.137169 0.263583 0.153995
C  -3.318201 -0.376635 -0.574061
H  0.059118 0.948427 1.201942
H  0.677252 -1.66631 -0.553657
H  -0.911168 0.203146 -1.533143
H  2.691524 -3.030218 -0.043575
H  3.138481 -1.830124 -1.298428
H  3.628463 -1.569838 0.405704
H  -0.207816 2.993704 0.297283
H  -3.626191 -1.287179 -0.039443
H  -4.154943 0.335413 -0.618192
