program: Gaussian 09
title: 000012319
version: EM64L-G09RevD.01
frameworkgroup: C1[X(C3H7NO)]
method: RPBEPBE
basis: SDD
operation: Freq
keyword: #pfreq=noraman
keyword: PBEPBE/SDD
title: #p freq=noraman PBEPBE/SDD
converged: NO NO NO NO
title: Mulliken charges:
elementType: O N C C C H H H H H H H
charge: -0.259875 -0.310860 -0.328505 -0.637507 -0.043436 0.218338 0.218337 0.243581 0.243581 0.198273 0.300226 0.157847
chargesum: 0.00000
title: Mulliken charges with hydrogens summed into heavy atoms:
elementType: O N C C C
charge: -0.259875 -0.010634 0.108170 0.047928 0.114412
polarizability: 4.97147903e+01 -2.73349474e+00 4.81676818e+01 -1.18374471e-04 -8.36991976e-05 2.89730460e+01
1716.lowfreq: -105.2465 -27.1697 -13.6485 0.0013 0.0014 0.0015 21.4495 230.3352 251.7567
frequency: -105.0462 230.3291 251.7096 325.3238 379.4113 607.9971 782.6710 797.2369 811.8235 958.2934 1012.7598 1103.0951 1140.0450 1225.5301 1282.8578 1334.6070 1391.5305 1407.9468 1468.3667 1470.2425 1478.6226 1512.0047 1664.7278 2876.0007 2967.4670 2992.0654 3012.1739 3093.4351 3137.0195 3513.2928
redmass: 2.0285 4.9597 1.1938 1.9853 3.4895 1.1290 3.3309 1.1256 4.5498 1.5886 2.2080 1.9884 1.5015 2.5062 1.1030 1.3608 1.1855 1.2082 1.0830 1.0410 1.1748 1.4108 5.6598 1.0843 1.0572 1.0448 1.1052 1.0903 1.1018 1.0768
irintensity: 4.3952 11.2250 11.4016 28.4385 1.2194 106.0077 9.4372 1.4936 2.8463 0.0926 4.2268 2.3109 8.4298 45.5145 0.4965 83.7048 18.9620 19.8422 19.3772 10.3574 7.3941 61.5752 269.4460 150.2526 52.1858 39.7527 38.4041 24.7381 26.2229 8.5611
temp: 298.150 k
press: 1.00000 atm
elementType: 8 7 6 6 6 1 1 1 1 1 1 1
symmnumber: 1
zpe: 264545.7 jmol-1
zpe.correction: 0.100760 hartree
zpe.thermalcorrener: 0.105904 hartree
zpe.thermalcorrenthalpy: 0.106848 hartree
zpe.thermalcorrgfe: 0.072695 hartree
zpe.sumelectzpe: -248.075325 hartree
zpe.sumelectthermal: -248.070181 hartree
zpe.sumelectthermalent: -248.069237 hartree
zpe.sumelectthermalfe: -248.103389 hartree
dipole: -1.9961 3.8767 0.0000
dipole: 4.3604
quadrupole: -30.9901 -29.6033 -31.2714
quadrupole: 4.7563 0.0000 0.0000
quadrupole: -0.3685 1.0183 -0.6498 4.7563 0.0000 0.0000
hfenergy: -248.1760847 hartree
pointgroup: C01[X(C3H7N1O1)]
dipole: 1.029938 -1.3719452 -0.0000055 debye
dipolederiv: -0.6770999 0.1098653 -0.0000013 0.4656944 -0.9760647 0.000002 0.0000064 -0.000009 -0.3523285 -1.0541129 0.3073931 0.000001 0.186091 -0.3863152 0.0000023 -0.0000004 0.0000042 -0.5049978 0.5447681 0.0731267 0.0000033 0.2238998 0.1744688 0.0000004 0.0000007 0. 0.3783533 0.0747263 0.0056664 -0.000002 -0.0137056 -0.0896618 0.0000013 -0.0000005 0.0000026 0.0442458 1.3307607 -0.3688665 0.0000016 -0.5762357 1.2594032 -0.0000002 -0.0000049 0.0000044 0.1281101 -0.0849125 0.0263112 -0.0755603 0.0035821 0.0138126 0.0894796 -0.1304239 0.0997267 -0.0849117 -0.0849147 0.0263133 0.0755602 0.003586 0.0138109 -0.08948 0.1304233 -0.0997268 -0.0849071 0.0806891 0.0624089 -0.0826302 0.0181307 0.0462148 0.0488269 -0.073542 0.0528853 -0.0520683 0.08069 0.0624085 0.0826288 0.018131 0.0462131 -0.0488282 0.0735406 -0.0528876 -0.0520682 -0.18674 -0.114859 0.0000017 -0.0704054 0.0522081 -0.0000002 0.0000013 0.0000004 0.1093666 0.088795 -0.0520372 -0.0000018 -0.0380999 0.0555686 -0.0000019 -0.0000027 -0.0000018 0.3517509 -0.1126491 -0.1377307 -0.0000009 -0.2206685 -0.2096584 -0.0000019 0.0000019 0.0000016 0.1194548 unknown
polarizability: 50.574903|-2.3241153|47.307569|0.0001027|0.0001024|28.973046 unknown
InChI: InChI=1S/C3H7NO/c1-2-4-3-5/h3-4H,2H2,1H3
charge 0 multiplicity 1
12 atoms
O  -1.580215 0.767076 0.000003
N  -0.044471 -1.045056 -0.000006
C  1.303274 -0.411586 0.000009
C  1.312916 1.127235 0.000001
C  -1.300599 -0.460686 -0.000013
H  1.851107 -0.774894 0.89237
H  1.851123 -0.774902 -0.892338
H  0.814752 1.540091 -0.889751
H  0.814761 1.5401 0.889753
H  2.368162 1.466009 -0.000007
H  -0.046399 -2.069093 -0.000012
H  -2.09181 -1.252795 -0.000009
