program: Gaussian 09
title: 000219891
version: EM64L-G09RevD.01
frameworkgroup: C1[X(C15H22O10)]
method: RPBEPBE
basis: SDD
operation: Freq
keyword: #p
keyword: freq=noraman
keyword: PBEPBE/SDD
title: #p freq=noraman PBEPBE/SDD
converged: YES YES NO NO
title: Mulliken charges:
elementType: O O O O O O O O O O C C C C C C C C C C C C C C C H H H H H H H H H H H H H H H H H H H H H H
charge: -0.283052 -0.271303 -0.278742 -0.259972 -0.264752 -0.286755 -0.263904 -0.259713 -0.262832 -0.263899 -0.104541 -0.069734 -0.055499 -0.351226 -0.357566 0.375757 0.326110 0.321734 -0.778583 0.332372 0.336123 -0.766801 -0.768576 -0.765362 -0.764346 0.313631 0.296150 0.294284 0.241002 0.267391 0.235990 0.270328 0.273147 0.258148 0.250565 0.282011 0.243243 0.250101 0.285013 0.243742 0.248678 0.278234 0.241042 0.245754 0.245979 0.241714 0.278913
chargesum: 0.00000
title: Mulliken charges with hydrogens summed into heavy atoms:
elementType: O O O O O O O O O O C C C C C C C C C C C C C C C
charge: -0.283052 -0.271303 -0.278742 -0.259972 -0.264752 -0.286755 -0.263904 -0.259713 -0.262832 -0.263899 0.209090 0.226417 0.238785 0.157168 0.148752 0.375757 0.326110 0.321734 0.003277 0.332372 0.336123 0.008554 0.008857 -0.000331 0.002260
polarizability: 2.46450448e+02 1.40539511e+00 1.58069314e+02 6.52501534e-01 -3.49808345e+00 1.76553403e+02
1716.lowfreq: -23.6939 -0.0008 -0.0006 -0.0005 3.8959 7.5115 9.0293 34.3836 37.8734
frequency: -23.6264 34.3563 37.7956 51.1724 57.4903 60.9354 63.4068 65.1779 75.5480 79.6947 82.8716 86.8322 88.7141 100.4049 104.8984 107.9442 115.1128 126.5912 129.7515 130.3474 154.9539 173.3399 187.1037 199.5134 220.3733 235.7011 246.2849 273.0670 281.0407 296.8459 321.9697 363.6689 388.1565 414.2829 428.5609 476.6978 484.6050 517.7975 548.5345 558.4731 561.8119 565.2647 569.1579 585.3410 594.2497 607.8269 609.8233 624.7662 632.7440 665.4807 776.6551 788.2673 798.1916 827.3171 853.3976 890.1062 892.7416 928.7548 942.1778 964.2220 983.3799 993.7789 998.1289 1001.5552 1003.6109 1008.1045 1020.2324 1045.2434 1046.4295 1048.1945 1048.8767 1050.2723 1060.9044 1100.4550 1135.3202 1159.2921 1174.4543 1181.6408 1187.6302 1194.4500 1214.3388 1219.5054 1228.1744 1262.6238 1301.6517 1319.2053 1327.7359 1346.6451 1353.0246 1358.9606 1374.8128 1379.4729 1381.7265 1382.5430 1384.1131 1385.5767 1451.8140 1452.7772 1453.0239 1454.1095 1454.4792 1455.3449 1456.3803 1456.4890 1457.9423 1458.7340 1461.8715 1484.0308 1642.1195 1645.5073 1650.0084 1651.7441 1655.3186 3002.9918 3003.5214 3006.0603 3006.6188 3007.4865 3024.8333 3036.6881 3040.9105 3047.0498 3056.4208 3094.7158 3100.0768 3100.4553 3101.9200 3102.9673 3103.5657 3111.0230 3141.7301 3141.9803 3142.1523 3142.4846 3143.1762
redmass: 1.4429 4.8562 4.9964 7.2301 4.4692 5.7144 8.0561 3.7901 4.7316 5.0535 4.1931 2.5480 3.7211 3.0873 1.0605 1.0428 1.0560 1.0324 5.7765 9.6728 4.4130 8.4129 8.6221 5.4914 6.9822 5.3380 8.9389 3.8982 4.8848 2.7695 3.1733 3.5517 3.1825 3.3173 3.6053 3.8143 3.8149 3.6839 3.7244 3.3107 3.4538 3.3902 3.4493 4.6716 4.9769 5.5500 4.3853 4.3165 4.1291 3.8004 4.3763 4.8313 4.8904 4.2240 3.9610 5.6402 5.1228 5.2393 5.3875 4.9299 2.7889 1.8898 2.1248 1.9416 2.0340 1.9330 2.9528 1.6591 1.6595 1.6516 1.6426 1.6442 2.8045 2.3766 3.0104 2.6124 3.0883 3.0831 2.7318 3.2339 2.6952 1.3827 1.2294 1.2551 1.2165 1.2476 1.3588 1.3905 1.5354 1.3481 1.3598 1.2513 1.2534 1.2394 1.2409 1.2389 1.0660 1.0577 1.0576 1.0598 1.0573 1.0541 1.0509 1.0554 1.0568 1.0571 1.0797 1.0806 10.2927 10.3198 9.7807 9.4895 9.4402 1.0390 1.0389 1.0379 1.0378 1.0374 1.0593 1.0576 1.0820 1.0835 1.0838 1.1068 1.0929 1.0931 1.0958 1.0940 1.0940 1.1077 1.1027 1.1028 1.1028 1.1027 1.1016
irintensity: 5.6146 0.0804 0.0785 1.7286 0.2032 2.5289 1.1487 1.5005 0.5066 0.8219 2.7870 6.6575 11.2543 1.6979 0.1556 0.4255 0.3991 0.3081 0.2218 7.0988 7.7696 1.0356 0.0802 19.5175 1.3478 1.0962 0.9343 1.2836 4.2803 17.2853 12.2826 22.6856 8.6544 14.0019 24.3620 1.7800 1.5245 8.3952 4.7238 5.4186 3.7671 3.1115 1.8905 23.1578 7.1431 0.4869 1.8154 9.4025 13.4498 1.9934 9.4499 12.7244 45.9609 4.4720 15.4014 14.4327 14.3743 9.9785 252.5143 77.4106 14.3407 16.3882 64.8280 80.1861 28.2927 120.7599 55.2919 21.7949 3.0211 7.1671 20.3106 21.8361 49.8412 5.7712 6.2686 1.2978 34.0369 12.9908 73.8955 1375.8582 1.9344 40.0946 54.6062 4.3563 8.8305 3.2271 1.3983 1.6793 1.6193 0.5084 10.7876 28.6821 112.2979 92.9636 39.4605 65.2464 3.6299 14.9063 58.1019 5.2187 4.7746 4.5062 9.8768 22.2198 9.9313 29.1919 20.4859 17.2592 258.1862 47.1715 293.4309 107.8920 120.5248 2.1765 0.1736 1.8137 2.0960 0.1299 20.9435 18.0641 5.2458 12.5946 5.0500 7.4886 9.4835 2.8686 2.6705 7.1639 6.4256 5.8289 5.3183 10.4023 4.1302 8.9306 5.4488
temp: 298.150 k
press: 1.00000 atm
elementType: 8 8 8 8 8 8 8 8 8 8 6 6 6 6 6 6 6 6 6 6 6 6 6 6 6 1 1 1 1 1 1 1 1 1 1 1 1 1 1 1 1 1 1 1 1 1 1
symmnumber: 1
zpe: 951694.5 jmol-1
zpe.correction: 0.362481 hartree
zpe.thermalcorrener: 0.390876 hartree
zpe.thermalcorrenthalpy: 0.391820 hartree
zpe.thermalcorrgfe: 0.301839 hartree
zpe.sumelectzpe: -1335.124878 hartree
zpe.sumelectthermal: -1335.096483 hartree
zpe.sumelectthermalent: -1335.095539 hartree
zpe.sumelectthermalfe: -1335.185520 hartree
dipole: -0.6168 0.0394 -1.3090
dipole: 1.4476
quadrupole: -144.7998 -148.3082 -141.0289
quadrupole: 0.4516 -7.5048 -6.4086
quadrupole: -0.0875 -3.5959 3.6834 0.4516 -7.5048 -6.4086
hfenergy: -1335.4873589 hartree
pointgroup: C01 [X(C15H22O10)]
dipole: 0.0212781 0.2380634 -0.5169541 debye
polarizability: 158.0526501|0.6767198|246.4533863|-3.5183961|-1.1343564|176.5671279 unknown
InChI: InChI=1S/C15H22O10/c1-8(16)21-6-13(23-10(3)18)15(25-12(5)20)14(24-11(4)19)7-22-9(2)17/h13-15H,6-7H2,1-5H3
charge 0 multiplicity 1
47 atoms
O  -0.175611 -0.889551 1.260472
O  1.412684 1.701023 -0.872848
O  -1.349961 1.866518 0.901965
O  2.762597 -0.937813 -0.46503
O  -2.551855 -0.975196 -1.177873
O  0.001469 -2.80265 -0.074042
O  1.700609 3.589382 0.475771
O  -1.614589 3.538015 -0.713633
O  3.08179 -2.606747 1.14304
O  -3.268492 -2.601894 0.341652
C  0.005874 -0.02126 0.065241
C  1.251979 0.847348 0.342261
C  -1.253605 0.830471 -0.169452
C  2.531578 0.059878 0.607964
C  -2.576019 0.052699 -0.108123
C  -0.163483 -2.287284 1.055212
C  1.606916 3.080936 -0.664859
C  -1.510867 3.206633 0.488634
C  -0.396471 -3.023542 2.345702
C  3.013575 -2.263421 -0.058436
C  -2.904488 -2.290403 -0.814007
C  1.631375 3.81318 -1.981996
C  -1.484125 4.13007 1.679241
C  3.132406 -3.166818 -1.25917
C  -2.732569 -3.223648 -1.985041
H  0.168913 -0.665655 -0.817447
H  1.074402 1.508792 1.210232
H  -1.150968 1.344336 -1.14226
H  3.396405 0.744429 0.609978
H  2.467275 -0.461796 1.579291
H  -3.416551 0.732261 -0.327201
H  -2.721087 -0.427473 0.873728
H  -1.405782 -3.472608 2.31131
H  0.341518 -3.836967 2.43804
H  -0.328281 -2.348658 3.210418
H  0.589316 4.072158 -2.248261
H  2.20801 4.745093 -1.883566
H  2.04495 3.179817 -2.781429
H  -0.428612 4.392222 1.881688
H  -2.035567 5.054349 1.450535
H  -1.896135 3.639604 2.574182
H  2.117951 -3.531916 -1.504365
H  3.766357 -4.032996 -1.016508
H  3.528242 -2.624082 -2.130798
H  -2.877121 -2.698413 -2.941042
H  -3.429364 -4.070685 -1.894966
H  -1.698893 -3.614737 -1.951802
