program: Gaussian 09
title: 000219880
version: EM64L-G09RevD.01
frameworkgroup: C1[X(C21H26O10)]
method: RPBEPBE
basis: SDD
operation: Freq
keyword: #p
keyword: freq=noraman
keyword: PBEPBE/SDD
title: #p freq=noraman PBEPBE/SDD
converged: YES YES NO NO
title: Mulliken charges:
elementType: O O O O O O O O O O C C C C C C C C C C C C C C C C C C C C C H H H H H H H H H H H H H H H H H H H H H H H H H H
charge: -0.247995 -0.282911 -0.290832 -0.270904 -0.296922 -0.258573 -0.245099 -0.227341 -0.234052 -0.250975 -0.189873 -0.047589 -0.102776 -0.022830 -0.041332 -0.379838 0.278810 0.338445 0.316607 0.328475 0.303313 -0.370919 -0.759282 -0.773392 0.318760 -0.759707 -0.391058 -0.802258 -0.224958 -0.757627 -0.243243 0.334309 0.301737 0.289386 0.237564 0.225134 0.250435 0.252887 0.241164 0.253466 0.251329 0.250727 0.247024 0.277292 0.242050 0.245566 0.253690 0.257057 0.236580 0.294075 0.208834 0.228517 0.228145 0.242429 0.246555 0.264525 0.227399
chargesum: 0.00000
title: Mulliken charges with hydrogens summed into heavy atoms:
elementType: O O O O O O O O O O C C C C C C C C C C C C C C C C C C C C C
charge: -0.247995 -0.282911 -0.290832 -0.270904 -0.296922 -0.258573 -0.245099 -0.227341 -0.234052 -0.250975 0.144436 0.254148 0.186610 0.214734 0.183802 0.123484 0.278810 0.338445 0.316607 0.328475 0.303313 -0.129755 -0.003759 -0.007026 0.318760 -0.003394 -0.154478 -0.070832 0.003187 -0.004117 -0.015844
polarizability: 3.01677544e+02 5.99953528e+00 2.13336344e+02 5.41444030e+00 6.65648015e+00 2.49641020e+02
1716.lowfreq: -3.4540 0.0007 0.0008 0.0008 5.0231 8.6259 14.4108 19.6521 25.6510
frequency: 14.1292 19.4450 25.6041 33.9368 38.4371 39.5116 47.2675 49.1819 53.9914 57.8110 67.7414 69.7048 73.5065 77.1963 80.1984 88.1491 91.8062 103.8573 106.0201 130.6286 136.1913 147.9784 156.7545 174.7614 193.7596 200.3223 215.7625 233.6797 241.5872 265.5051 278.4584 279.8801 297.5392 312.6285 351.8570 382.7382 388.1233 420.3983 436.3801 444.0098 462.1861 480.2316 499.3957 503.1321 515.9403 546.0245 552.4258 558.6990 561.6440 563.1945 577.6942 592.5419 599.4372 612.2089 631.9700 643.8268 666.5181 710.8586 723.5704 749.6823 770.4575 781.8735 807.5162 820.3754 834.7839 847.2169 860.2252 884.4340 894.6736 902.1538 937.6137 946.6937 964.1513 976.9767 979.3987 986.8955 990.9902 992.7861 1001.2915 1005.0888 1015.5275 1021.3848 1038.7448 1042.8442 1043.2959 1043.6850 1045.8353 1055.6454 1056.6240 1064.5169 1104.2801 1108.2703 1138.8004 1153.2306 1165.8343 1168.6757 1178.0010 1183.9006 1190.2047 1202.8917 1220.8279 1226.6686 1245.8379 1270.5377 1272.8844 1275.9501 1296.3932 1316.1831 1327.9370 1340.4209 1343.6548 1353.2619 1372.9128 1374.7823 1380.5516 1382.9824 1384.4684 1385.3558 1385.5522 1407.7072 1427.0218 1451.3111 1452.1186 1452.3092 1452.9387 1453.3090 1453.7478 1455.5488 1456.3162 1457.9381 1458.5025 1475.5491 1482.0982 1588.6869 1609.5160 1659.7971 1662.6427 1667.2287 1674.4785 2933.4089 2981.1206 2990.0151 3002.8158 3004.2114 3007.8008 3008.5447 3031.6816 3044.4351 3048.4880 3069.2046 3075.4579 3094.4394 3098.1238 3098.4612 3098.9622 3099.2932 3114.7642 3123.2341 3133.0281 3139.9519 3140.6065 3144.2146 3145.5480 3145.8861 3164.5024
redmass: 4.5758 5.3520 6.8926 5.6624 4.7387 4.1704 4.6979 1.6583 1.7769 4.3651 4.3145 1.8828 1.9439 4.3050 3.1689 3.8982 1.2243 1.0503 4.3321 1.0367 5.5973 5.3503 6.1182 4.4723 7.7207 8.1836 5.7339 5.4882 4.1121 5.4134 5.3298 5.6801 2.9823 4.0978 6.1368 3.3883 3.3917 3.6448 3.7185 4.3123 3.2676 3.7297 4.4000 4.7558 4.2773 4.0615 3.3424 3.6375 3.5622 3.3686 4.3690 5.7826 5.5847 4.8613 4.7290 5.1375 4.8582 3.9425 2.9064 2.8056 1.8899 4.5828 4.2467 5.4830 5.4939 4.8274 1.4210 3.7989 6.2575 3.9348 1.4375 4.5929 4.4047 3.2395 1.3160 1.6195 2.1400 1.9133 2.7626 2.3353 3.9567 4.3084 2.0296 1.6581 1.6642 1.7037 1.6594 2.4713 1.5421 3.3106 2.2186 2.6521 2.7266 2.5196 2.2702 1.0916 2.9398 3.3149 3.4919 3.3180 2.6677 1.4380 1.1443 1.2997 1.2581 1.4940 1.1805 1.3466 1.3574 1.4501 1.3598 1.3576 1.8964 2.9673 1.4224 1.2555 1.2582 1.2573 1.3790 1.2275 2.0554 1.0815 1.0578 1.0532 1.0549 1.0606 1.0527 1.0497 1.0600 1.0534 1.0537 1.7329 1.4860 6.0589 7.0154 9.3798 9.8346 10.2359 9.8161 1.0826 1.0835 1.0362 1.0389 1.0381 1.0378 1.0372 1.0588 1.0830 1.0850 1.0868 1.0969 1.1005 1.0964 1.0932 1.0956 1.0944 1.1060 1.0858 1.0887 1.1026 1.1022 1.1015 1.1014 1.0944 1.1009
irintensity: 0.0957 0.2499 0.0472 0.8856 0.5877 1.4802 0.3466 3.8498 0.9902 1.2023 0.8791 1.8691 0.8842 1.5343 0.1582 8.2573 1.7098 0.4533 2.3668 0.3131 1.6950 5.9622 2.4494 2.2387 3.2939 2.5342 6.7100 4.0846 2.2266 5.7943 0.1828 10.2960 4.2071 8.1540 5.8588 18.9038 9.6982 4.2007 12.6285 8.6807 1.8199 3.7562 8.0360 16.1329 9.0315 2.5439 5.8282 9.1882 0.9960 8.8643 1.5369 8.1270 0.8351 4.8689 15.4093 1.7013 7.3793 7.7127 27.2124 29.0963 40.2279 15.9906 35.6837 3.2800 32.7792 64.4478 3.8099 62.1578 58.7274 49.9664 1.0975 118.9824 32.9026 76.8502 0.2054 1.2799 59.6007 52.7457 239.0216 31.5667 148.7050 51.6970 12.7182 5.2168 7.3491 10.5844 22.7409 87.8526 4.0590 29.9013 108.5435 27.4199 15.2590 15.6093 71.8799 3.5018 188.7365 435.2778 583.9966 123.2790 27.2772 12.2546 12.1048 13.8993 12.2774 0.9098 7.0148 6.6147 7.4344 6.5159 14.3575 1.9005 18.6557 1.2365 22.1581 63.9022 66.9801 46.6494 29.8212 15.9480 9.1603 8.8084 36.0217 10.0596 19.4412 35.4865 10.6628 17.0022 18.5113 19.4560 7.9024 13.6114 70.7296 15.0839 1.4881 132.8903 211.1519 183.8981 167.8910 28.3058 18.9103 20.0018 1.5963 1.5622 1.1065 1.1207 24.0537 2.0014 18.0148 2.9971 8.3996 20.9371 6.9039 9.3930 6.5283 5.8929 6.2618 3.6921 7.3236 6.9870 8.5297 9.1515 10.5658 29.2865 22.8143
temp: 298.150 k
press: 1.00000 atm
elementType: 8 8 8 8 8 8 8 8 8 8 6 6 6 6 6 6 6 6 6 6 6 6 6 6 6 6 6 6 6 6 6 1 1 1 1 1 1 1 1 1 1 1 1 1 1 1 1 1 1 1 1 1 1 1 1 1 1
symmnumber: 1
zpe: 1160853.4 jmol-1
zpe.correction: 0.442146 hartree
zpe.thermalcorrener: 0.475743 hartree
zpe.thermalcorrenthalpy: 0.476688 hartree
zpe.thermalcorrgfe: 0.371412 hartree
zpe.sumelectzpe: -1565.738642 hartree
zpe.sumelectthermal: -1565.705045 hartree
zpe.sumelectthermalent: -1565.704100 hartree
zpe.sumelectthermalfe: -1565.809376 hartree
dipole: -0.2160 3.3882 3.7457
dipole: 5.0554
quadrupole: -175.3179 -186.5261 -167.6155
quadrupole: -4.8727 -3.5367 8.9455
quadrupole: 1.1686 -10.0396 8.8710 -4.8727 -3.5367 8.9455
hfenergy: -1566.1807881 hartree
pointgroup: C01 [X(C21H26O10)]
dipole: -0.379968 -0.7670734 1.7952977 debye
polarizability: 301.7260772|-7.9131224|213.5357586|4.517725|5.5905613|249.3930721 unknown
InChI: InChI=1S/C21H26O10/c1-11-8-6-7-9-16(11)30-21-20(29-15(5)25)19(28-14(4)24)18(27-13(3)23)17(31-21)10-26-12(2)22/h6-9,17-21H,10H2,1-5H3
charge 0 multiplicity 1
57 atoms
O  -0.557655 -0.441916 -0.287753
O  1.938019 0.757668 1.884017
O  2.727472 -1.802307 0.832369
O  1.247815 1.417887 -1.682945
O  -1.330817 1.743284 -0.653609
O  -1.306339 -3.102242 0.645032
O  4.246448 0.510811 2.176535
O  4.303883 -1.53784 -0.871015
O  1.308447 3.756969 -1.778859
O  -2.301715 -3.078285 -1.474965
C  2.07976 0.547938 0.412814
C  1.800035 -0.932407 0.071647
C  1.027227 1.475384 -0.225214
C  0.360253 -1.327803 0.456931
C  -0.393248 0.973511 0.100884
C  0.009631 -2.757838 0.054706
C  -2.711438 1.567841 -0.300197
C  3.112917 0.702206 2.66203
C  4.010961 -1.9818 0.257177
C  1.311677 2.657432 -2.365259
C  -3.556414 0.893382 -1.218345
C  -3.191555 2.133941 0.898742
C  2.773899 0.895434 4.121344
C  4.911326 -2.729968 1.205385
C  -2.406738 -3.158585 -0.232688
C  1.38272 2.409369 -3.851668
C  -4.929116 0.797927 -0.870516
C  -3.010706 0.296756 -2.498445
C  -4.561208 2.014206 1.223471
C  -3.689874 -3.307387 0.551718
C  -5.430936 1.341015 0.334905
H  3.099388 0.82953 0.099588
H  1.963045 -1.061227 -1.015032
H  1.153978 2.516211 0.124647
H  0.214509 -1.196891 1.550053
H  -0.569559 1.05635 1.198079
H  0.735335 -3.465403 0.484617
H  -0.042971 -2.856989 -1.044271
H  -2.503203 2.679762 1.553788
H  2.296566 -0.02102 4.513115
H  2.058512 1.723686 4.250486
H  3.692689 1.09293 4.691975
H  5.727012 -3.212412 0.646696
H  5.348265 -1.997285 1.909128
H  4.348115 -3.473538 1.790875
H  1.599628 3.350179 -4.377122
H  2.153565 1.655159 -4.081341
H  0.414624 2.00765 -4.200468
H  -5.610054 0.286718 -1.561531
H  -2.409758 -0.605305 -2.282777
H  -3.829102 0.011402 -3.181221
H  -2.34336 1.008952 -3.014319
H  -4.944979 2.454366 2.150193
H  -4.443245 -3.825305 -0.061036
H  -3.518566 -3.846545 1.495856
H  -4.074929 -2.299394 0.79459
H  -6.496739 1.251035 0.572401
