program: Gaussian 09
title: 000219876
version: EM64L-G09RevD.01
frameworkgroup: C1[X(C18H16N6)]
method: RPBEPBE
basis: SDD
operation: Freq
keyword: #pfreq=noraman
keyword: PBEPBE/SDD
title: #p freq=noraman PBEPBE/SDD
converged: YES YES NO NO
title: Mulliken charges:
elementType: N N N N N N C C C C C C C C C C C C C C C C C C H H H H H H H H H H H H H H H H
charge: -0.194492 -0.463500 -0.112427 -0.148503 -0.015368 -0.420868 -0.047050 0.165341 0.249140 -0.424341 0.005194 0.452765 -0.615901 0.444282 -0.456455 -0.323416 -0.451502 -0.318897 -0.200226 -0.226056 -0.259884 -0.200282 -0.227767 -0.265004 0.253888 0.315527 0.245232 0.245410 0.255156 0.325822 0.221942 0.306615 0.224696 0.295744 0.227234 0.230127 0.229882 0.224947 0.225707 0.227286
chargesum: 0.00000
title: Mulliken charges with hydrogens summed into heavy atoms:
elementType: N N N N N N C C C C C C C C C C C C C C C C C C
charge: -0.194492 -0.147973 -0.112427 -0.148503 -0.015368 -0.095045 -0.047050 0.165341 0.249140 -0.170454 0.005194 0.452765 0.129898 0.444282 -0.234513 -0.016801 -0.226805 -0.023152 0.027008 0.004071 -0.030002 0.024665 -0.002061 -0.037718
polarizability: 3.91491225e+02 1.61934110e-01 3.12492626e+02 2.98268055e+00 -1.97734652e+01 1.03437357e+02
1716.lowfreq: -5.4289 -3.6207 -0.0002 0.0007 0.0008 1.9638 23.2353 34.5728 39.3544
frequency: 23.0950 34.5680 39.3503 44.4806 75.8900 89.2485 101.7077 110.4527 147.1158 167.5138 202.0329 211.5381 244.7706 249.9184 259.7359 273.5874 289.2482 341.3264 348.4530 405.3073 412.7892 496.0943 504.3091 506.9356 527.7115 556.2820 587.7007 594.8542 613.0050 614.1752 615.0845 644.7902 660.4699 691.8850 695.0627 699.7914 710.3535 724.5412 744.0946 761.5610 764.8261 778.0163 789.5352 817.1865 831.6017 842.0976 845.4273 867.9914 902.6730 918.6437 940.5253 965.0993 972.7060 983.9011 984.6120 988.3671 999.2667 1006.5879 1023.7767 1028.4480 1052.9917 1085.6889 1092.2750 1128.8243 1155.1364 1169.5130 1171.3810 1184.2719 1188.1799 1212.1745 1223.8523 1239.9900 1250.1807 1265.8744 1316.9749 1317.9160 1332.5709 1368.0625 1381.6541 1391.7009 1411.1307 1418.0383 1434.7166 1438.6134 1457.1102 1462.0872 1467.5957 1483.4713 1486.9606 1494.8713 1518.0478 1521.0646 1571.4572 1587.1018 1599.5005 1610.5894 1615.7957 1617.5389 3002.8013 3093.4423 3109.0240 3112.6752 3124.0337 3128.5367 3132.0372 3141.2272 3144.1848 3163.7644 3165.8178 3200.8802 3202.6081 3205.3921 3528.8449 3540.8233
redmass: 3.6524 5.0700 4.8756 5.3780 4.1546 1.0843 4.9445 4.0600 5.0490 4.4479 5.4192 5.0949 5.1274 4.6911 4.9872 4.5533 5.4001 5.4417 7.0147 2.8936 3.0019 3.4441 2.9567 3.4706 7.5398 7.0676 5.2050 1.5146 6.3177 5.8062 6.4638 1.4813 5.4094 2.0263 4.7888 2.4618 4.2271 4.7312 6.9205 1.7493 1.7596 3.4672 6.4961 1.6964 1.3041 4.0819 1.3560 5.4648 1.4739 1.3906 3.7686 1.3675 1.3767 4.3315 3.6235 1.5705 3.6400 1.3436 2.2622 2.0335 3.7467 1.5918 1.7472 1.3082 2.0766 1.0593 1.0537 1.1080 1.1137 3.2070 2.1886 2.3205 4.6920 2.8642 2.5720 1.5403 2.2369 3.1415 6.9450 6.4339 3.5340 2.2992 2.0623 2.1861 2.5231 2.3306 1.0426 2.2905 1.7196 1.6856 2.2733 5.3114 5.3641 7.0331 4.4576 3.5594 5.7173 5.8483 1.0332 1.1025 1.0887 1.0878 1.1012 1.0871 1.0868 1.0936 1.0934 1.0999 1.0999 1.0939 1.0943 1.0970 1.0749 1.0755
irintensity: 0.2944 0.0554 0.0699 0.4914 0.1671 0.0660 0.1600 1.3488 1.2404 1.0106 0.8847 2.0206 4.1529 11.4412 1.2462 1.3245 2.3115 8.3575 1.2459 0.3556 0.0584 29.3542 2.9388 22.9571 9.0986 2.2767 11.5484 36.9491 1.7508 4.6348 2.3105 34.1032 11.0653 79.9499 25.4197 7.8138 17.4832 9.9654 18.8357 111.1955 35.6797 84.9906 1.0437 10.0693 1.5680 1.7442 0.0370 3.8105 24.2957 0.4998 25.6060 0.4625 0.0999 1.8506 0.8831 2.1088 1.6509 1.2361 3.0947 12.0946 33.6943 5.7857 6.5541 0.9802 22.6615 0.7264 0.0565 1.4329 9.6311 14.4892 0.2084 82.9671 7.5555 9.6771 0.5380 8.6458 33.0139 3.7441 14.6240 16.6536 342.8631 137.0471 38.9500 85.4684 63.7472 71.1937 15.3118 158.3441 105.6108 151.6459 636.8049 318.0816 411.0722 378.3924 33.3271 362.2983 28.5635 53.2192 67.3545 19.6317 12.9669 12.6827 5.2635 1.1511 0.3645 33.5769 25.7041 31.9961 29.5524 3.5751 5.2103 5.4629 37.5209 25.4379
temp: 298.150 k
press: 1.00000 atm
elementType: 7 7 7 7 7 7 6 6 6 6 6 6 6 6 6 6 6 6 6 6 6 6 6 6 1 1 1 1 1 1 1 1 1 1 1 1 1 1 1 1
symmnumber: 1
zpe: 819400.8 jmol-1
zpe.correction: 0.312093 hartree
zpe.thermalcorrener: 0.331759 hartree
zpe.thermalcorrenthalpy: 0.332703 hartree
zpe.thermalcorrgfe: 0.262030 hartree
zpe.sumelectzpe: -1022.378150 hartree
zpe.sumelectthermal: -1022.358484 hartree
zpe.sumelectthermalent: -1022.357540 hartree
zpe.sumelectthermalfe: -1022.428214 hartree
dipole: 0.1280 0.5053 0.0237
dipole: 0.5218
quadrupole: -133.7373 -114.6504 -146.3088
quadrupole: 4.8291 0.7266 -5.7516
quadrupole: -2.1718 16.9151 -14.7433 4.8291 0.7266 -5.7516
hfenergy: -1022.6902435 hartree
pointgroup: C01[X(C18H16N6)]
dipole: -0.0528191 -0.1982955 0.0055443 debye
polarizability: 391.4509703|-0.6614594|311.6100217|-4.0889914|24.0426236|104.3602163 unknown
InChI: InChI=1S/C18H16N6/c1-24-17-15(12-19-24)16(20-13-8-4-2-5-9-13)22-18(23-17)21-14-10-6-3-7-11-14/h2-12,20-21H,1H3
charge 0 multiplicity 1
40 atoms
N  4.335757 0.653901 -0.00142
N  0.642936 -2.230913 -0.131266
N  2.133368 1.739816 0.075461
N  0.269902 0.127704 -0.005248
N  4.850767 -0.652674 -0.084736
N  -0.046402 2.495786 0.130141
C  2.542009 -0.712594 -0.078219
C  2.953601 0.657708 0.004582
C  1.122852 -0.931809 -0.06864
C  3.760286 -1.467273 -0.128036
C  0.802187 1.397486 0.056545
C  -0.677165 -2.752344 -0.02845
C  5.234486 1.801958 0.062855
C  -1.454433 2.61869 0.030293
C  -0.856448 -4.116845 -0.389326
C  -1.786149 -2.003721 0.446614
C  -2.019757 3.868726 0.412383
C  -2.306808 1.594645 -0.463307
C  -2.123662 -4.722862 -0.279919
C  -3.049845 -2.624276 0.547626
C  -3.23273 -3.978957 0.186902
C  -3.407441 4.088008 0.307083
C  -3.695308 1.827998 -0.558647
C  -4.259381 3.066838 -0.175932
H  3.921158 -2.543158 -0.189788
H  1.366945 -2.937329 -0.277101
H  5.879068 1.735946 0.955553
H  5.870941 1.842662 -0.83714
H  4.615099 2.710687 0.119677
H  0.477584 3.364448 0.264785
H  -0.003404 -4.700878 -0.759416
H  -1.646853 -0.96097 0.732283
H  -1.368528 4.664908 0.795545
H  -1.875153 0.641907 -0.771011
H  -2.244702 -5.774469 -0.562257
H  -3.897489 -2.037844 0.920011
H  -4.218507 -4.448342 0.270054
H  -3.823339 5.056656 0.606288
H  -4.339564 1.030446 -0.94671
H  -5.338281 3.236236 -0.255613
