program: Gaussian 09
title: 000012317
version: EM64L-G09RevD.01
frameworkgroup: C1[X(C3H7FO)]
method: RPBEPBE
basis: SDD
operation: Freq
keyword: #pfreq=noraman
keyword: PBEPBE/SDD
title: #p freq=noraman PBEPBE/SDD
converged: YES YES NO YES
title: Mulliken charges:
elementType: F O C C C H H H H H H H
charge: -0.243440 -0.274075 -0.230879 -0.203424 -0.496967 0.183905 0.212185 0.188465 0.220329 0.198711 0.237980 0.207210
chargesum: 0.00000
title: Mulliken charges with hydrogens summed into heavy atoms:
elementType: F O C C C
charge: -0.243440 -0.274075 0.165211 0.205371 0.146933
polarizability: 4.36305399e+01 -2.10924058e+00 3.47260548e+01 -5.56420874e-02 1.37155756e-01 3.24872566e+01
1716.lowfreq: -12.0683 -5.1460 0.0015 0.0015 0.0018 7.5971 76.9308 125.8650 218.7374
frequency: 76.9258 125.8358 218.7294 260.8425 337.2968 497.7393 797.9164 844.9735 996.4468 1016.8704 1068.4814 1105.0665 1118.5139 1156.5118 1192.0344 1245.8372 1364.8139 1386.9577 1435.7653 1445.8588 1454.7671 1457.9391 1477.0260 2912.1100 2927.0704 2974.6184 2999.7919 3019.7749 3094.6697 3108.3424
redmass: 3.2795 2.4676 1.3496 2.2951 2.7883 2.6305 2.9412 2.9944 2.6570 2.6658 2.3348 2.2019 1.5947 1.3814 1.1453 1.1250 1.2370 1.4054 1.1414 1.0893 1.0798 1.0527 1.0675 1.0565 1.0376 1.0985 1.1024 1.0585 1.1093 1.0969
irintensity: 5.3752 3.9381 5.4046 7.1699 2.1844 10.0706 14.4614 28.8091 31.1235 44.5379 43.9145 23.6971 10.5477 7.0648 7.8752 5.1247 6.6930 6.4968 0.7978 9.4285 16.7143 13.3041 5.9908 56.6128 87.3952 50.3749 71.4779 55.5055 32.2014 28.4835
temp: 298.150 k
press: 1.00000 atm
elementType: 9 8 6 6 6 1 1 1 1 1 1 1
symmnumber: 1
zpe: 257912.0 jmol-1
zpe.correction: 0.098234 hartree
zpe.thermalcorrener: 0.104527 hartree
zpe.thermalcorrenthalpy: 0.105472 hartree
zpe.thermalcorrgfe: 0.068227 hartree
zpe.sumelectzpe: -293.119960 hartree
zpe.sumelectthermal: -293.113666 hartree
zpe.sumelectthermalent: -293.112722 hartree
zpe.sumelectthermalfe: -293.149967 hartree
dipole: 1.7637 2.7262 0.8808
dipole: 3.3644
quadrupole: -29.1112 -30.2380 -30.1978
quadrupole: -4.1110 2.2661 -0.0901
quadrupole: 0.7378 -0.3890 -0.3488 -4.1110 2.2661 -0.0901
hfenergy: -293.2181937 hartree
pointgroup: C01 [X(C3H7F1O1)]
dipole: -0.6961298 1.1167329 -0.1425905 debye
dipolederiv: -0.4700445 0.1634728 0.038346 0.2314733 -0.5568406 -0.1049443 0.1043661 -0.1523814 -0.3502078 -0.9598437 -0.1756021 -0.0193347 -0.2148778 -0.5024175 -0.0342643 0.0371666 0.011326 -0.4293031 0.3953764 0.2140394 -0.1303857 0.2700633 0.4910357 -0.0124317 -0.3021471 -0.001174 0.3201069 0.4686771 -0.1805727 -0.0667292 -0.1885873 0.6470919 0.1223747 -0.1104314 0.104367 0.4284247 0.6615719 0.0245861 0.0613256 -0.0537765 0.302339 0.0691007 0.1618111 0.1001468 0.3327465 -0.0251464 0.0796875 0.0345354 -0.0352845 -0.2382898 -0.0205004 0.0569703 -0.0535285 0.0517541 0.0113161 -0.0226885 -0.0250154 -0.0681454 0.0374999 -0.0370531 0.0561747 0.0277892 -0.1944282 -0.0579973 -0.093564 0.0336658 -0.080007 -0.1195189 -0.0071999 0.0703332 0.0389061 0.0691027 0.0855277 0.0236681 0.0199292 0.0520551 0.0409527 0.036234 -0.005495 -0.0184438 -0.1267854 -0.0720795 0.0566264 -0.0112868 0.1837362 -0.1716053 -0.0366111 -0.0373398 -0.048887 0.0622144 -0.0254727 -0.0862681 0.0439565 -0.1128135 0.0021616 0.0827004 0.0694108 0.0890142 0.046023 -0.0118852 -0.0033848 0.0209931 0.0161641 0.0675913 -0.0574049 -0.1008195 -0.0971347 -0.2096477 unknown
polarizability: 43.6489164|2.0717131|34.6988659|-0.095715|0.1586395|32.496069 unknown
InChI: InChI=1S/C3H7FO/c1-5-3-2-4/h2-3H2,1H3
charge 0 multiplicity 1
12 atoms
F  1.960577 -0.678317 -0.410174
O  -0.920863 -0.213456 0.426814
C  -0.03222 0.727306 -0.250503
C  1.380054 0.489306 0.253002
C  -2.281115 -0.174236 -0.104185
H  -0.334619 1.776532 -0.022785
H  -0.064231 0.588354 -1.353659
H  2.035653 1.347098 0.014944
H  1.376672 0.283078 1.337759
H  -2.744284 0.828365 0.023505
H  -2.856267 -0.916166 0.471002
H  -2.304856 -0.445262 -1.181119
