program: Gaussian 09
title: 000219871
version: EM64L-G09RevD.01
frameworkgroup: C1[X(C19H16ClN5)]
method: RPBEPBE
basis: SDD
operation: Freq
keyword: #p
keyword: freq=noraman
keyword: PBEPBE/SDD
title: #p freq=noraman PBEPBE/SDD
converged: YES YES NO NO
title: Mulliken charges:
elementType: Cl N N N N N C C C C C C C C C C C C C C C C C C C H H H H H H H H H H H H H H H H
charge: -0.065971 -0.289125 -0.056830 -0.464366 0.001274 -0.129684 -0.046481 0.136800 0.224474 0.049926 0.401246 -0.428369 -0.458585 0.481323 -0.355766 -0.402708 -0.683263 -0.272379 -0.479634 -0.226844 -0.204126 -0.245968 -0.090375 -0.177722 -0.276942 0.257761 0.228889 0.220914 0.319437 0.315601 0.286207 0.235594 0.224199 0.223697 0.345116 0.225165 0.226967 0.228621 0.229326 0.233442 0.259161
chargesum: 0.00000
title: Mulliken charges with hydrogens summed into heavy atoms:
elementType: Cl N N N N N C C C C C C C C C C C C C C C C C C C
charge: -0.065971 -0.289125 -0.056830 -0.144930 0.001274 -0.129684 -0.046481 0.136800 0.224474 0.049926 0.401246 -0.170607 -0.008783 0.481323 -0.040165 -0.116500 0.000228 0.072736 -0.254469 0.000123 0.024495 -0.016642 -0.090375 0.055720 -0.017781
polarizability: 4.64459300e+02 5.82296887e+00 2.79037231e+02 -1.22279390e+00 -8.83796028e+00 1.03764191e+02
1716.lowfreq: -3.3662 -2.0957 0.0012 0.0012 0.0013 5.5245 18.4914 30.5753 37.5661
frequency: 18.4522 30.5628 37.4091 44.9948 52.8708 70.3831 103.5864 112.5528 143.2447 156.2557 178.9158 201.6542 206.8891 229.4788 240.5059 270.2385 280.5112 295.4151 329.2456 359.0264 382.2213 387.7100 410.8658 417.3409 441.9844 487.3058 515.9112 549.8184 558.5985 584.1526 610.4689 613.3549 622.2971 630.2172 677.5831 678.2812 685.0508 685.9132 702.6988 712.3807 736.5647 773.6774 780.0891 789.6314 792.4163 806.4705 827.8388 860.9799 872.2586 878.6509 921.1141 935.4285 942.4146 961.8512 963.6206 979.8685 987.6898 993.1290 1006.1412 1012.1131 1028.6491 1036.6813 1052.5640 1065.5058 1070.8482 1085.1577 1098.6817 1111.3625 1171.6109 1174.7799 1178.9642 1192.5035 1233.9665 1238.6140 1244.5479 1278.1727 1284.8466 1314.1841 1323.6772 1330.3918 1368.9988 1375.6843 1385.4182 1391.6800 1396.6640 1413.3944 1420.9337 1436.4127 1451.8461 1458.8487 1469.3983 1475.1539 1487.8070 1490.5120 1512.0654 1529.0813 1569.5387 1596.7592 1604.0848 1612.0720 1614.0627 2987.9970 3008.6068 3075.8203 3087.6357 3101.7555 3117.7910 3130.4418 3142.4025 3153.5888 3161.2079 3175.1972 3181.4813 3188.9921 3189.6780 3205.7157 3540.6160
redmass: 7.5934 5.4674 3.3052 3.7127 5.2984 5.6015 4.6101 5.4802 4.7958 4.6177 5.3013 2.1300 3.9579 3.9117 2.7615 3.1861 4.0382 5.6809 4.6759 5.5889 6.2873 8.9620 2.9731 4.5209 3.1269 5.0229 3.3285 6.1800 3.3821 6.8210 1.7015 4.7979 5.9369 6.3750 7.0504 6.5880 2.1513 6.2004 2.0953 4.8700 4.6638 1.6577 1.5376 2.5617 4.6005 1.6191 1.9287 1.2470 6.0070 1.4096 4.4279 1.3538 1.4064 3.7610 1.3328 6.0976 6.1994 1.3485 1.3023 4.3238 2.5146 2.8679 2.7463 1.9311 1.9548 1.6763 1.6785 2.1902 1.2034 1.7496 1.0817 1.2223 1.8460 1.6568 2.5774 1.7175 2.4045 1.7366 1.8591 1.9948 4.3897 2.4076 5.8584 2.2737 5.9214 3.7858 3.6273 2.9852 2.4758 1.1437 2.3582 1.0563 1.2083 2.1254 3.6268 7.6148 7.4230 6.8515 3.2185 6.5241 5.3844 1.0346 1.0622 1.0989 1.1008 1.1015 1.0895 1.0854 1.0908 1.0921 1.0965 1.0970 1.0972 1.0953 1.0937 1.0971 1.0756
irintensity: 0.1483 0.6343 0.1726 0.0978 0.0807 0.1062 1.2959 0.8363 0.3040 0.1367 1.2740 0.4348 1.4653 1.1928 0.3418 0.3019 1.7283 2.7342 6.4564 4.4590 2.2548 7.2983 0.0013 0.9564 8.7864 1.3388 9.4534 3.1919 3.9776 1.3121 27.1221 5.0345 1.8457 0.8602 23.6197 16.9845 33.7316 57.0249 37.4329 1.4322 8.8596 61.0285 71.2721 34.2892 10.3078 15.7064 10.5798 0.0304 23.5220 0.9767 53.5351 26.6198 10.7822 78.7666 0.3303 7.9263 1.4725 0.2059 2.4883 1.7976 2.9258 1.8854 31.9580 40.0558 14.7489 2.1041 13.7166 19.5092 1.1696 3.5632 1.1488 18.1810 48.8591 8.5528 0.5968 4.4328 4.1499 4.6933 94.3867 90.9049 8.3107 70.6452 17.1387 100.1844 98.4015 85.4437 14.8671 34.0854 30.0086 11.1713 204.0225 18.2163 59.4357 322.2897 20.7980 489.6822 513.2188 23.1683 480.1355 38.1207 0.0523 34.6052 16.3151 3.0125 36.4315 42.0639 12.4824 0.0020 24.3293 14.0997 23.3102 33.3317 3.8279 5.9195 40.1217 2.4922 22.9780
temp: 298.150 k
press: 1.00000 atm
elementType: 17 7 7 7 7 7 6 6 6 6 6 6 6 6 6 6 6 6 6 6 6 6 6 6 6 1 1 1 1 1 1 1 1 1 1 1 1 1 1 1 1
symmnumber: 1
zpe: 822811.5 jmol-1
zpe.correction: 0.313392 hartree
zpe.thermalcorrener: 0.334334 hartree
zpe.thermalcorrenthalpy: 0.335279 hartree
zpe.thermalcorrgfe: 0.261270 hartree
zpe.sumelectzpe: -1465.716384 hartree
zpe.sumelectthermal: -1465.695442 hartree
zpe.sumelectthermalent: -1465.694498 hartree
zpe.sumelectthermalfe: -1465.768507 hartree
dipole: -0.1299 -2.8128 0.3505
dipole: 2.8375
quadrupole: -148.0247 -134.7343 -159.5026
quadrupole: 16.7429 -1.3111 -1.3251
quadrupole: -0.6041 12.6862 -12.0821 16.7429 -1.3111 -1.3251
hfenergy: -1466.0297765 hartree
pointgroup: C01 [X(C19H16Cl1N5)]
dipole: -0.1294073 -1.0994761 0.1438066 debye
polarizability: 464.3686718|-6.9979155|279.0027174|2.0072567|-9.9618103|103.8893327 unknown
InChI: InChI=1S/C19H16ClN5/c1-2-17-23-18(22-14-8-6-7-13(20)11-14)16-12-21-25(19(16)24-17)15-9-4-3-5-10-15/h3-12,22H,2H2,1H3
charge 0 multiplicity 1
41 atoms
Cl -5.994705 2.314652 -0.374633
N  2.600325 -0.857865 -0.040278
N  1.33652 1.274887 -0.243036
N  -2.088333 -1.217329 -0.053406
N  2.27917 -2.224926 0.074987
N  -1.088086 0.948152 -0.243101
C  0.338875 -0.993339 -0.052396
C  1.441906 -0.084074 -0.119895
C  -0.967394 -0.402243 -0.116895
C  0.051399 1.725631 -0.300413
C  3.983773 -0.470165 -0.058001
C  0.926378 -2.294723 0.066656
C  -0.169296 3.217088 -0.416879
C  -3.472284 -0.90297 -0.084812
C  4.345841 0.89716 -0.151635
C  4.977067 -1.477765 0.021723
C  -0.765404 3.818063 0.883563
C  -3.969482 0.422847 -0.204551
C  -4.383427 -1.992695 0.011608
C  5.713627 1.244655 -0.163655
C  6.337595 -1.109294 0.007913
C  6.715424 0.250897 -0.084262
C  -5.361464 0.607995 -0.222307
C  -5.771741 -1.760537 -0.010912
C  -6.287207 -0.44819 -0.128672
H  0.45956 -3.275831 0.147283
H  0.797117 3.692946 -0.652081
H  -0.866526 3.406556 -1.254279
H  -1.883699 -2.214592 0.036217
H  3.565723 1.659194 -0.214096
H  4.671668 -2.523704 0.093434
H  -1.724698 3.331436 1.131442
H  -0.945622 4.900511 0.758671
H  -0.074469 3.679593 1.734359
H  -3.265839 1.252321 -0.28013
H  -4.004978 -3.018504 0.1043
H  5.993843 2.301383 -0.235858
H  7.104456 -1.889265 0.069526
H  7.774342 0.530775 -0.094291
H  -6.463907 -2.605523 0.064008
H  -7.363351 -0.258409 -0.146315
