program: Gaussian 09
title: 000219849
version: EM64L-G09RevD.01
frameworkgroup: C1[X(C12H10N6O2)]
method: RPBEPBE
basis: SDD
operation: Freq
keyword: #p
keyword: freq=noraman
keyword: PBEPBE/SDD
title: #p freq=noraman PBEPBE/SDD
converged: YES YES NO NO
title: Mulliken charges:
elementType: O O N N N N N N C C C C C C C C C C C C H H H H H H H H H H
charge: -0.213796 -0.214765 -0.283072 -0.000242 -0.085904 -0.082154 -0.618707 0.019193 0.151853 0.013774 0.416572 -0.411437 0.178163 -0.322187 -0.375905 0.046899 -0.379871 -0.353035 0.400065 -0.747858 0.266078 0.327915 0.297165 0.285769 0.287763 0.243366 0.242218 0.242198 0.329031 0.340912
chargesum: 0.00000
title: Mulliken charges with hydrogens summed into heavy atoms:
elementType: O O N N N N N N C C C C C C C C C C C C
charge: -0.213796 -0.214765 -0.283072 -0.000242 -0.085904 -0.082154 0.051236 0.019193 0.151853 0.013774 0.416572 -0.145358 0.178163 0.005727 -0.078740 0.046899 -0.094103 -0.065272 0.400065 -0.020076
polarizability: 3.50092614e+02 -6.62765105e+00 2.04064272e+02 6.52397713e-02 8.88143531e-02 7.24666512e+01
1716.lowfreq: -3.4642 -0.0005 -0.0002 0.0003 5.1249 6.4514 37.1878 40.1602 53.2009
frequency: 37.1708 40.0808 53.1807 75.9686 82.4586 96.9477 145.4900 192.0099 199.1653 229.4971 229.9461 288.7602 289.8431 306.3867 366.7358 391.7883 421.0456 451.1093 469.0572 490.0851 510.2654 513.3419 558.1023 565.4372 596.8691 622.4589 631.8564 645.0172 648.1502 671.2147 678.8871 701.6664 746.9035 782.4665 790.8255 808.6520 842.5488 860.5005 887.2072 902.1773 960.3601 986.6294 1003.6023 1004.1765 1019.5769 1043.4742 1049.3116 1086.4510 1095.4846 1104.2548 1122.7248 1177.7142 1199.2257 1221.5721 1276.2285 1289.9458 1301.9354 1325.9626 1357.9299 1378.5776 1386.8712 1396.9028 1401.3448 1411.7599 1438.2097 1453.8826 1455.8433 1466.5419 1498.3511 1538.4671 1583.3232 1595.0748 1612.7516 1630.8317 2999.8171 3081.2588 3132.1754 3164.2219 3178.6479 3185.5161 3198.6337 3211.1101 3541.1899 3697.8222
redmass: 6.8226 4.9800 1.0844 5.6082 6.7324 6.0450 5.0462 7.3230 4.8777 6.8781 7.5892 3.4060 4.0014 6.8566 5.0406 5.0709 3.0455 1.1860 6.4539 7.9211 3.3781 6.2662 1.2395 4.9037 4.5363 7.0951 4.5871 3.9876 8.2316 5.5051 8.9525 8.9031 4.7102 8.8491 3.6640 6.8114 1.6676 1.2675 1.5517 4.3899 2.9089 3.1613 3.0529 1.3364 1.3171 4.4053 1.6005 2.2920 3.3009 2.8397 1.4398 1.4134 1.5613 4.9420 4.8796 3.7102 1.4559 5.9861 8.1207 2.4681 4.6370 2.0834 5.7702 6.8817 3.5751 4.0252 1.0514 1.1920 3.2180 6.9866 2.9943 8.4741 4.9789 1.9208 1.0376 1.0968 1.0999 1.0920 1.0897 1.0955 1.0963 1.0974 1.0456 1.1043
irintensity: 0.0006 0.2900 0.5920 0.0132 0.0809 3.8589 3.3510 3.4907 3.0362 1.6550 6.3747 4.7617 3.7532 0.8556 0.4488 1.1035 0.0392 147.0432 6.6993 5.1067 0.4045 3.6386 135.4048 0.7844 1.4474 3.6111 4.0756 0.2168 14.1811 11.8538 24.3168 2.8648 1.8112 41.5006 25.6223 8.7647 15.3688 5.3754 77.1170 40.3906 38.9285 10.5416 0.8921 0.0035 0.0535 29.4350 7.0204 2.7329 35.8358 2.3131 27.8215 154.7867 16.7078 645.0521 31.5100 22.2037 8.6604 232.3478 111.7370 31.2831 232.2389 48.5418 14.5881 55.8022 65.2357 14.6300 15.7557 12.1561 223.3421 145.1806 210.7359 8.9716 384.3748 403.0573 8.4106 10.8246 10.3526 19.9367 0.5485 2.3458 0.2542 2.1012 143.7642 37.8152
temp: 298.150 k
press: 1.00000 atm
elementType: 8 8 7 7 7 7 7 7 6 6 6 6 6 6 6 6 6 6 6 6 1 1 1 1 1 1 1 1 1 1
symmnumber: 1
zpe: 568746.3 jmol-1
zpe.correction: 0.216624 hartree
zpe.thermalcorrener: 0.233075 hartree
zpe.thermalcorrenthalpy: 0.234019 hartree
zpe.thermalcorrgfe: 0.171285 hartree
zpe.sumelectzpe: -940.767672 hartree
zpe.sumelectthermal: -940.751221 hartree
zpe.sumelectthermalent: -940.750277 hartree
zpe.sumelectthermalfe: -940.813011 hartree
dipole: 9.7198 -2.5589 0.0062
dipole: 10.0510
quadrupole: -127.3692 -105.5491 -117.1232
quadrupole: -6.5131 0.0685 -0.0032
quadrupole: -10.6887 11.1314 -0.4427 -6.5131 0.0685 -0.0032
hfenergy: -940.9842959 hartree
pointgroup: C01 [X(C12H10N6O2)]
dipole: 3.8434493 0.9287469 -0.048512 debye
polarizability: 350.2890119|3.6432946|203.7816558|-1.8414632|-3.1427428|72.5528696 unknown
InChI: InChI=1S/C12H10N6O2/c1-7-15-11(13)10-6-14-17(12(10)16-7)8-2-4-9(5-3-8)18(19)20/h2-6H,13H2,1H3
charge 0 multiplicity 1
30 atoms
O  -5.39418 -1.589021 0.051235
O  -5.877904 0.640856 0.005227
N  0.522852 0.882319 -0.039374
N  0.908724 2.243674 -0.07569
N  1.681793 -1.31694 0.008377
N  4.119698 -1.113631 -0.013697
N  5.254536 0.927002 -0.075155
N  -5.040862 -0.34524 0.021922
C  1.647221 0.046856 -0.026315
C  2.787039 0.908903 -0.055971
C  -0.864249 0.56133 -0.022965
C  2.260058 2.243151 -0.085331
C  4.060332 0.253219 -0.04875
C  -1.287474 -0.795076 0.009149
C  -1.814501 1.617663 -0.039817
C  2.949966 -1.834954 0.013294
C  -2.660954 -1.089522 0.023836
C  -3.185671 1.319801 -0.025008
C  -3.597073 -0.032179 0.006572
C  3.091138 -3.334627 0.051036
H  2.779334 3.200204 -0.112812
H  -0.537693 -1.589456 0.021932
H  -1.460351 2.649686 -0.064402
H  -3.018529 -2.122049 0.048339
H  -3.940517 2.10997 -0.037422
H  2.100648 -3.811615 0.079778
H  3.646037 -3.688349 -0.836186
H  3.67565 -3.641024 0.936697
H  5.301816 1.941651 -0.102157
H  6.111817 0.376199 -0.067344
