program: Gaussian 09
title: 000012315
version: EM64L-G09RevD.01
frameworkgroup: C1[X(C4H11N)]
method: RPBEPBE
basis: SDD
operation: Freq
keyword: #pfreq=noraman
keyword: PBEPBE/SDD
title: #p freq=noraman PBEPBE/SDD
converged: YES YES NO NO
title: Mulliken charges:
elementType: N C C C C H H H H H H H H H H H
charge: -0.299285 -0.319261 -0.369238 -0.679091 -0.624518 0.202250 0.168743 0.184327 0.221276 0.248012 0.209372 0.207347 0.217826 0.187595 0.220157 0.224489
chargesum: 0.00000
title: Mulliken charges with hydrogens summed into heavy atoms:
elementType: N C C C C
charge: -0.051274 0.051732 0.036365 -0.044546 0.007722
polarizability: 6.24850329e+01 4.41866616e-02 4.78551967e+01 -2.18817545e-02 7.27795857e-01 4.45939716e+01
1716.lowfreq: -34.4526 -21.3549 -0.0005 0.0005 0.0008 2.9285 95.0812 105.0807 174.7728
frequency: 95.0673 105.0655 174.7623 223.0208 234.4638 377.6990 408.7177 651.8179 756.0928 883.7678 891.3774 961.2599 1051.3767 1069.0950 1096.6458 1137.8973 1163.1258 1197.3553 1239.4671 1278.3981 1304.2823 1367.1343 1388.1592 1433.9136 1443.5644 1464.1696 1471.5325 1478.3655 1482.6758 1489.5728 1498.6602 2833.1470 2864.4065 2965.2140 2974.3823 2990.5105 3009.4256 3036.0933 3071.2412 3071.9911 3075.5979 3443.1594
redmass: 2.3419 1.6759 2.4780 1.1118 1.1947 2.4968 3.5808 1.3055 1.0792 1.2080 1.5441 2.3838 1.8057 1.8694 1.4064 1.9470 3.2470 1.9181 1.3174 1.0945 1.3603 1.4818 1.2111 1.1467 1.2162 1.0655 1.0616 1.0443 1.0607 1.0608 1.0719 1.0714 1.0571 1.0662 1.0363 1.0828 1.0742 1.0976 1.1008 1.0993 1.0991 1.0743
irintensity: 1.3595 2.3132 1.6559 0.1767 2.2084 9.0585 0.6274 130.0845 8.0655 3.3222 2.5601 4.6775 9.1247 14.0421 0.3841 3.5776 31.4304 2.2273 2.8667 1.9623 0.0645 2.5220 13.2138 1.6174 18.4128 10.2953 5.0996 13.5746 3.6722 18.1888 6.4889 101.5693 173.7439 26.5623 32.5245 51.4854 51.3541 13.0856 81.3910 43.1852 51.5482 1.9997
temp: 298.150 k
press: 1.00000 atm
elementType: 7 6 6 6 6 1 1 1 1 1 1 1 1 1 1 1
symmnumber: 1
zpe: 383724.2 jmol-1
zpe.correction: 0.146153 hartree
zpe.thermalcorrener: 0.153344 hartree
zpe.thermalcorrenthalpy: 0.154288 hartree
zpe.thermalcorrgfe: 0.115614 hartree
zpe.sumelectzpe: -213.311973 hartree
zpe.sumelectthermal: -213.304782 hartree
zpe.sumelectthermalent: -213.303838 hartree
zpe.sumelectthermalfe: -213.342512 hartree
dipole: 0.0035 -0.2905 1.0320
dipole: 1.0721
quadrupole: -32.3738 -33.4675 -33.9968
quadrupole: -0.4616 1.4033 2.1418
quadrupole: 0.9056 -0.1882 -0.7174 -0.4616 1.4033 2.1418
hfenergy: -213.4581263 hartree
pointgroup: C01 [X(C4H11N1)]
dipole: -0.0025786 0.1550131 -0.3922612 debye
dipolederiv: -0.7329497 -0.0296304 0.0037012 -0.0218485 -0.5104361 0.2166065 -0.0243894 0.2682632 -0.321067 0.4035817 -0.1829251 0.03536 -0.2226638 0.308637 -0.1098025 -0.057127 -0.1028302 0.3632016 -0.0164549 0.0096342 0.0115219 0.0095427 0.0922222 0.0201183 -0.0122305 0.0443076 0.171019 -0.0622679 0.0393994 0.0019007 0.011516 0.0489835 -0.0040607 -0.0028123 -0.0058568 0.0984441 0.3832926 0.1629781 -0.0358023 0.2360376 0.3216069 -0.1065616 0.0684467 -0.0956465 0.2833409 0.0333598 -0.0015187 -0.0213944 0.0289493 -0.0484426 -0.1063489 -0.0000803 -0.1319841 -0.1052938 -0.0686169 0.0232902 -0.0045883 0.0987334 -0.1407798 0.1543729 -0.0626302 0.2038963 -0.1526031 0.025648 0.0317723 0.0268495 0.0016931 -0.0487386 -0.1289751 0.0180132 -0.1645389 -0.1019806 0.0491568 0.0206419 -0.0180535 -0.0029205 -0.0328257 0.1163806 0.006512 0.135516 -0.0720234 0.0957642 -0.0271674 -0.0298567 0.0124168 0.1889423 -0.1102212 -0.0188036 -0.2325063 0.0619763 0.0780781 0.0039499 -0.0203118 0.0501472 -0.0199026 -0.1266055 0.0254509 -0.1397212 -0.0849664 0.0771648 0.0045084 0.0170444 0.0518426 -0.0148503 0.1240806 -0.0305068 0.1387003 -0.0946448 -0.152921 -0.1055936 0.0059316 -0.1370751 0.0018744 0.0033537 0.0036408 0.0017009 0.1025405 -0.0445026 -0.0380951 -0.0022229 -0.1802469 -0.1267577 0.173911 0.0967378 0.1954254 -0.13838 -0.1440684 0.0941674 0.0051752 0.1470747 -0.0177084 -0.0056103 0.0288643 0.0093349 0.1094209 0.0757354 -0.0054115 0.0247452 -0.0831985 -0.0018245 -0.1106379 -0.0390856 -0.1240606 -0.1189843 unknown
polarizability: 62.4841661|0.0631315|47.6740742|-0.1196711|1.0426108|44.7759608 unknown
InChI: InChI=1S/C4H11N/c1-3-4-5-2/h5H,3-4H2,1-2H3
charge 0 multiplicity 1
16 atoms
N  1.246587 -0.452603 -0.023869
C  0.0212 0.372627 -0.020102
C  -1.24342 -0.508816 -0.004725
C  -2.544583 0.321516 -0.006203
C  2.506484 0.312347 -0.011908
H  0.037606 1.004798 0.8911
H  -0.031546 1.076985 -0.892294
H  -1.23176 -1.178909 -0.890161
H  -1.20276 -1.162773 0.886673
H  1.224311 -1.149256 -0.780806
H  -2.593081 0.983827 0.878663
H  -2.611182 0.959768 -0.907632
H  -3.436136 -0.331209 0.0125
H  2.614775 1.040978 -0.854251
H  3.365438 -0.381481 -0.045427
H  2.579967 0.886601 0.930842
