program: Gaussian 09
title: 000219841
version: EM64L-G09RevD.01
frameworkgroup: C1[X(C14H15N5)]
method: RPBEPBE
basis: SDD
operation: Freq
keyword: #pfreq=noraman
keyword: PBEPBE/SDD
title: #p freq=noraman PBEPBE/SDD
converged: YES YES NO NO
title: Mulliken charges:
elementType: N N N N N C C C C C C C C C C C C C C H H H H H H H H H H H H H H H
charge: -0.282093 -0.376918 -0.007941 -0.082505 -0.086191 -0.009961 0.138807 0.206045 0.400412 -0.428919 0.024604 -0.304294 -0.356361 -0.403836 -0.752465 -0.720866 -0.228389 -0.204808 -0.248348 0.258184 0.316155 0.235874 0.240385 0.317211 0.285525 0.242104 0.236645 0.236791 0.223168 0.218879 0.235050 0.224710 0.226307 0.227040
chargesum: 0.00000
title: Mulliken charges with hydrogens summed into heavy atoms:
elementType: N N N N N C C C C C C C C C C C C C C
charge: -0.282093 -0.060763 -0.007941 -0.082505 -0.086191 -0.009961 0.138807 0.206045 0.400412 -0.170735 0.024604 0.171964 -0.039150 -0.118311 -0.036925 -0.043769 -0.003679 0.021499 -0.021308
polarizability: 3.13682099e+02 1.52790720e-01 2.01879693e+02 -5.78731333e-01 3.67703676e-01 8.57246637e+01
1716.lowfreq: -6.3168 0.0006 0.0007 0.0008 2.1859 7.3006 23.0082 43.5913 45.1763
frequency: 22.2640 43.5193 45.0383 60.6875 84.1220 108.1457 128.5375 133.3231 192.3625 210.6031 249.0685 254.9272 270.1344 290.8405 316.7517 361.4426 364.3430 412.0531 413.4978 446.3999 488.5773 514.8199 581.0475 610.0340 617.3601 627.2049 644.9524 675.2635 680.8267 703.2173 726.7123 772.6129 784.9104 793.4754 803.0364 828.8388 861.2607 896.1648 931.7369 941.1212 987.1711 992.0078 992.5699 996.3698 1006.5183 1024.6450 1045.5560 1049.0384 1060.7821 1096.9918 1104.2928 1143.6716 1150.5269 1171.1254 1184.3665 1192.8988 1240.2216 1257.3996 1284.4224 1323.2037 1328.8111 1335.2678 1374.5418 1384.0015 1389.6586 1394.0500 1398.1484 1405.2882 1419.1542 1450.9674 1456.8593 1467.3946 1478.9209 1479.1820 1485.9034 1494.3249 1498.5491 1533.9659 1596.3438 1597.5865 1614.3826 2982.4186 2995.6558 2996.7429 3039.0246 3077.9779 3078.1863 3094.3198 3128.0588 3128.6003 3139.9754 3158.9990 3170.9237 3187.5168 3206.4129 3571.8564
redmass: 2.6871 3.7839 3.3262 1.0385 4.0587 3.0049 3.9206 4.1413 2.8344 5.9112 3.8382 1.3957 4.7953 4.9407 3.0856 5.1025 4.2840 2.9832 5.1721 1.1959 5.3379 3.2565 7.5010 5.6147 6.3980 6.4452 4.0545 10.4443 6.2578 2.0767 6.1699 1.6649 3.0949 1.1256 7.3260 1.7348 1.2468 2.3279 4.9102 1.4076 6.1327 5.6829 1.3420 1.9292 1.2995 2.6350 2.7954 1.5967 2.9338 1.7430 2.6276 1.5288 3.4719 1.0586 1.5560 1.3821 2.5918 1.1051 5.9654 1.7676 2.8162 1.4791 3.0764 2.4916 3.1610 5.5003 1.2573 3.2778 2.0199 2.2835 1.0470 1.2243 1.0995 1.0938 2.3221 1.9693 1.4087 7.2728 6.7230 6.7196 5.9664 1.0373 1.0602 1.0376 1.1021 1.1012 1.0970 1.0981 1.0854 1.0996 1.0907 1.0961 1.0977 1.0952 1.0972 1.0777
irintensity: 0.0044 0.1678 2.0887 0.5754 1.1524 0.2477 0.9627 0.4062 0.0972 6.3033 0.0233 0.5081 0.2272 8.3555 1.5569 4.1526 12.7330 0.0005 1.3891 81.9526 1.2547 4.1162 0.3509 3.9132 0.3305 2.6213 3.0299 8.7436 32.3792 37.5028 1.5392 59.2199 38.6772 0.7761 11.7035 12.7979 0.0130 16.8018 30.6555 10.2891 1.8470 19.8375 0.3687 2.7488 2.4278 1.5635 19.1048 6.4472 5.9938 18.5255 3.9735 2.3058 31.8757 0.0380 5.6723 24.0988 12.7662 0.6279 16.9783 102.3782 101.9047 80.3139 43.2044 11.3668 119.3988 32.7748 51.1697 74.9819 18.7732 19.9667 15.3445 10.4431 35.6794 44.6275 109.6168 134.5303 15.2219 168.1244 181.0483 541.6508 1.7900 32.3306 24.3238 17.1080 4.9388 41.5705 25.9030 31.1738 0.2327 12.6554 26.6209 18.6295 36.0786 4.5211 3.2455 57.5338
temp: 298.150 k
press: 1.00000 atm
elementType: 7 7 7 7 7 6 6 6 6 6 6 6 6 6 6 6 6 6 6 1 1 1 1 1 1 1 1 1 1 1 1 1 1 1
symmnumber: 1
zpe: 710192.9 jmol-1
zpe.correction: 0.270498 hartree
zpe.thermalcorrener: 0.287408 hartree
zpe.thermalcorrenthalpy: 0.288353 hartree
zpe.thermalcorrgfe: 0.224241 hartree
zpe.sumelectzpe: -814.904524 hartree
zpe.sumelectthermal: -814.887614 hartree
zpe.sumelectthermalent: -814.886670 hartree
zpe.sumelectthermalfe: -814.950781 hartree
dipole: 3.7187 -1.2716 -0.0099
dipole: 3.9301
quadrupole: -87.3995 -103.9369 -116.1847
quadrupole: -9.3486 -0.1040 0.1710
quadrupole: 15.1075 -1.4299 -13.6777 -9.3486 -0.1040 0.1710
hfenergy: -815.1750223 hartree
pointgroup: C01 [X(C14H15N5)]
dipole: 1.4633183 0.499457 -0.0072659 debye
polarizability: 313.6777114|-0.1837919|201.8004321|1.1405655|-3.0592305|85.808312 unknown
InChI: InChI=1S/C14H15N5/c1-3-15-13-12-9-16-19(11-7-5-4-6-8-11)14(12)18-10(2)17-13/h4-9,15H,3H2,1-2H3
charge 0 multiplicity 1
34 atoms
N  -1.075039 0.711948 -0.029325
N  3.649049 0.798146 -0.008596
N  -0.695076 2.069852 -0.063382
N  0.093736 -1.484508 0.035496
N  2.53459 -1.269917 0.044883
C  1.189449 0.747077 -0.018381
C  0.049732 -0.116211 -0.001666
C  2.470076 0.09778 0.006223
C  -2.471961 0.383355 -0.028998
C  0.659742 2.077109 -0.056594
C  1.361585 -1.991858 0.056787
C  4.974038 0.148383 0.019213
C  -2.891534 -0.970689 0.000551
C  -3.423734 1.433422 -0.059182
C  1.509917 -3.492629 0.097015
C  6.086579 1.203145 -0.09228
C  -4.272532 -1.261589 -0.000763
C  -4.798479 1.121174 -0.059785
C  -5.232861 -0.224956 -0.030758
H  1.173046 3.037631 -0.079776
H  3.610684 1.817347 -0.025036
H  5.076683 -0.43536 0.953781
H  5.033864 -0.580322 -0.80994
H  -2.141657 -1.76492 0.023756
H  -3.074169 2.467782 -0.081634
H  0.520326 -3.972343 0.120564
H  2.070371 -3.845141 -0.787498
H  2.090715 -3.795721 0.986386
H  6.014423 1.766065 -1.041302
H  6.047679 1.922696 0.747159
H  7.074916 0.713345 -0.066203
H  -4.595951 -2.308327 0.02191
H  -5.532303 1.934532 -0.08311
H  -6.302599 -0.4608 -0.031515
