program: Gaussian 09
title: 000219838
version: EM64L-G09RevD.01
frameworkgroup: C1[X(C18H16N6)]
method: RPBEPBE
basis: SDD
operation: Freq
keyword: #pfreq=noraman
keyword: PBEPBE/SDD
title: #p freq=noraman PBEPBE/SDD
converged: YES YES NO NO
title: Mulliken charges:
elementType: N N N N N N C C C C C C C C C C C C C C C C C C H H H H H H H H H H H H H H H H
charge: -0.281493 -0.001045 -0.074043 -0.400042 -0.088504 -0.373936 0.001840 0.136692 0.197009 0.402648 -0.430439 0.037013 -0.354902 -0.402140 0.454010 -0.752311 -0.227254 -0.204075 -0.246606 -0.419269 -0.345224 -0.199377 -0.209409 -0.263812 0.263892 0.325105 0.315559 0.286090 0.309365 0.243243 0.243942 0.236293 0.226211 0.228047 0.228710 0.224227 0.240126 0.223599 0.222650 0.227611
chargesum: 0.00000
title: Mulliken charges with hydrogens summed into heavy atoms:
elementType: N N N N N N C C C C C C C C C C C C C C C C C C
charge: -0.281493 -0.001045 -0.074043 -0.074938 -0.088504 -0.064571 0.001840 0.136692 0.197009 0.402648 -0.166548 0.037013 -0.039343 -0.116051 0.454010 -0.028831 -0.001042 0.023972 -0.017896 -0.195042 -0.105098 0.024222 0.013241 -0.036202
polarizability: 3.96662410e+02 1.84562495e+01 2.24396230e+02 -8.56986600e+00 -1.51122863e+00 1.43238357e+02
1716.lowfreq: -13.3009 -3.5057 -0.0006 0.0002 0.0007 3.4861 9.8554 19.8476 32.2450
frequency: 9.5035 18.8188 32.2174 39.9570 52.4199 70.5939 100.9797 126.5483 150.9038 158.4464 188.1335 209.6671 234.9539 260.8284 265.0978 294.2969 335.0864 363.0701 396.5528 406.4613 410.7331 434.9655 469.0317 487.3172 497.9772 514.6385 528.2352 575.4280 600.8094 612.5193 615.9191 626.0155 644.7129 652.4640 672.5577 685.8174 693.9384 702.8723 730.7737 757.6842 772.8337 784.5355 804.3725 826.2504 831.3639 836.0291 860.6076 889.8204 930.9271 941.8107 961.8090 981.6961 982.2765 984.1711 987.6974 992.4634 1001.7622 1005.5415 1021.7045 1026.7682 1045.4255 1048.9953 1069.0143 1087.3843 1099.1220 1161.1432 1170.2307 1172.0222 1180.9887 1189.7783 1197.5299 1247.5073 1277.2448 1286.8335 1314.1638 1321.4691 1327.2879 1374.8437 1383.2344 1385.1729 1390.8272 1394.6628 1401.0163 1415.6055 1435.9846 1450.9033 1456.4284 1466.0708 1468.6049 1483.8249 1492.8605 1509.2469 1528.1821 1584.4004 1596.9452 1603.0594 1613.7394 1619.0774 2997.6715 3078.9303 3118.9847 3128.8561 3130.0224 3130.8522 3141.5984 3141.7099 3155.1735 3160.7481 3168.5558 3173.2490 3188.5345 3210.9831 3484.4186 3548.5648
redmass: 5.5030 5.2421 3.8018 3.8530 6.1488 1.0573 5.0881 4.5004 4.4994 4.4003 4.3332 7.3096 3.5708 3.8006 3.9252 6.2705 3.7800 5.2090 4.4053 2.8817 2.9691 2.0049 3.3239 2.1650 3.1637 3.1997 3.3080 6.4583 6.0951 6.3029 6.4208 6.1073 4.1039 4.3257 8.9834 5.8884 2.0108 2.0710 6.1952 1.7191 1.6713 3.4605 7.3607 1.4136 1.6727 2.8593 1.2462 1.4749 7.1862 1.4071 1.3690 1.3115 5.8360 2.6131 5.8659 1.3478 5.0720 1.3025 2.1538 2.5389 2.9862 1.5967 2.4164 1.7201 1.7524 3.1463 1.0583 1.0721 1.1148 1.2557 1.8964 2.6668 4.7809 4.8483 1.3853 2.8603 1.7914 3.6311 5.3182 2.1547 3.0563 5.0934 4.0359 2.1062 2.2733 2.3341 1.0475 1.4570 1.9258 2.5295 2.8092 1.4336 8.1866 5.7931 6.9333 4.9549 5.9719 6.1464 1.0376 1.0967 1.0864 1.0865 1.0854 1.0998 1.0930 1.0907 1.0943 1.0962 1.1010 1.0974 1.0953 1.0973 1.0756 1.0785
irintensity: 0.0665 0.1904 0.2415 0.0245 0.4273 0.6746 0.9141 1.0175 0.5510 0.4174 2.6352 1.2629 6.7563 3.0768 0.4232 3.5285 16.3372 4.3848 4.2492 2.5159 0.0051 50.3620 65.0993 123.5617 72.2599 2.1516 22.3251 1.6339 15.0693 1.8618 2.6369 9.7351 3.1110 20.3025 20.4658 29.5412 40.7387 37.6273 0.8114 94.3849 57.1668 36.0928 10.0883 1.8837 12.1220 14.6543 0.0187 12.4555 60.7279 9.9048 0.2953 1.1077 1.2566 14.5129 4.2086 0.2412 9.8051 2.2155 8.7810 1.4656 31.9793 6.2612 6.2733 11.8278 18.8665 8.1876 0.2548 0.2040 5.6563 3.5140 30.8045 2.7345 92.8543 33.8598 8.1686 153.1232 61.8097 41.3072 69.6040 16.6823 67.9572 93.4765 64.4432 46.7205 5.2169 23.6755 16.0673 46.8873 8.8039 177.1748 185.6645 17.8714 233.9911 489.5373 8.1036 16.1404 27.6671 101.9376 10.0339 11.4260 10.4996 1.1961 0.0718 12.1350 24.1066 26.0021 36.9084 19.6948 16.4068 33.6848 4.6335 2.1110 24.5437 86.1703
temp: 298.150 k
press: 1.00000 atm
elementType: 7 7 7 7 7 7 6 6 6 6 6 6 6 6 6 6 6 6 6 6 6 6 6 6 1 1 1 1 1 1 1 1 1 1 1 1 1 1 1 1
symmnumber: 1
zpe: 815034.2 jmol-1
zpe.correction: 0.310430 hartree
zpe.thermalcorrener: 0.330367 hartree
zpe.thermalcorrenthalpy: 0.331311 hartree
zpe.thermalcorrgfe: 0.258388 hartree
zpe.sumelectzpe: -1022.337332 hartree
zpe.sumelectthermal: -1022.317395 hartree
zpe.sumelectthermalent: -1022.316451 hartree
zpe.sumelectthermalfe: -1022.389374 hartree
dipole: 1.0019 -0.2004 -0.9751
dipole: 1.4124
quadrupole: -132.6759 -129.6071 -138.3249
quadrupole: 0.3606 -3.4808 -0.6356
quadrupole: 0.8600 3.9289 -4.7889 0.3606 -3.4808 -0.6356
hfenergy: -1022.6477621 hartree
pointgroup: C01 [X(C18H16N6)]
dipole: 0.3921429 -0.0681686 0.3877486 debye
polarizability: 395.243588|-25.7926674|217.425294|2.6292703|24.6778708|151.6281154 unknown
InChI: InChI=1S/C18H16N6/c1-13-20-17(23-22-14-8-4-2-5-9-14)16-12-19-24(18(16)21-13)15-10-6-3-7-11-15/h2-12,22-23H,1H3
charge 0 multiplicity 1
40 atoms
N  -2.499331 0.647558 0.579366
N  -2.159484 1.825473 1.27671
N  -1.30368 -1.389404 -0.20259
N  2.114545 0.363367 1.560775
N  1.070701 -1.388867 0.386166
N  3.335731 -0.329125 1.57578
C  -0.286385 0.510493 1.040882
C  -1.381556 -0.172331 0.420097
C  0.972151 -0.169017 0.985493
C  -3.85959 0.461123 0.157219
C  -0.835345 1.73335 1.545869
C  -0.056379 -1.941723 -0.185498
C  -4.236417 -0.702555 -0.55937
C  -4.815861 1.459633 0.468555
C  4.320345 -0.018411 0.590332
C  0.126172 -3.284416 -0.845446
C  -5.580688 -0.855812 -0.960721
C  -6.153446 1.287055 0.058471
C  -6.54536 0.13146 -0.657426
C  5.44152 -0.883376 0.470836
C  4.244073 1.146412 -0.214128
C  6.467295 -0.584008 -0.447563
C  5.282299 1.436479 -1.126656
C  6.398995 0.579137 -1.251897
H  -0.356379 2.550375 2.083623
H  2.04691 1.173385 2.178073
H  -3.484394 -1.460808 -0.789327
H  -4.499876 2.346897 1.021151
H  3.209039 -1.328686 1.770432
H  -0.822499 -3.62426 -1.286019
H  0.899806 -3.220817 -1.631098
H  0.477691 -4.02941 -0.108956
H  -5.871608 -1.755111 -1.514905
H  -6.891567 2.059751 0.300161
H  -7.586312 0.003683 -0.973369
H  5.506933 -1.78193 1.096782
H  3.374273 1.806208 -0.136957
H  7.32455 -1.261236 -0.534416
H  5.211783 2.337157 -1.747287
H  7.199246 0.809606 -1.962646
