program: Gaussian 09
title: 000219808
version: EM64L-G09RevD.01
frameworkgroup: C1[X(C13H10N2O3)]
method: RPBEPBE
basis: SDD
operation: Freq
keyword: #p
keyword: freq=noraman
keyword: PBEPBE/SDD
title: #p freq=noraman PBEPBE/SDD
converged: YES YES NO NO
title: Mulliken charges:
elementType: O O O N N C C C C C C C C C C C C C H H H H H H H H H H
charge: -0.420241 -0.213674 -0.211744 -0.064354 0.024978 0.466796 -0.354149 -0.358363 0.378736 0.236949 -0.365502 -0.351690 -0.371675 -0.292012 -0.332432 -0.341252 -0.358395 0.281388 0.237982 0.284781 0.286977 0.286243 0.210466 0.237144 0.258867 0.256083 0.227426 0.360668
chargesum: 0.00000
title: Mulliken charges with hydrogens summed into heavy atoms:
elementType: O O O N N C C C C C C C C C C C C C
charge: -0.059573 -0.213674 -0.211744 -0.064354 0.024978 0.466796 -0.116167 -0.073582 0.378736 0.236949 -0.078525 -0.065447 -0.161210 -0.054868 -0.073565 -0.085169 -0.130969 0.281388
polarizability: 4.88176663e+02 -8.70681958e+00 1.62903736e+02 -1.24873866e-01 4.55815318e-01 6.53896431e+01
1716.lowfreq: -7.0975 -3.2179 -0.0004 -0.0002 0.0004 1.4949 25.8585 32.7843 48.1239
frequency: 25.7320 32.7821 48.1068 67.0334 85.0619 140.8126 171.8463 196.4585 208.6271 279.4464 306.4750 372.7512 387.4256 390.5941 393.6899 412.6669 416.9475 471.8356 491.1082 511.0170 528.5622 535.0236 623.8906 634.8096 652.4168 667.0368 721.2046 745.4428 759.3230 782.1173 806.8867 830.8466 831.5089 849.1087 864.2023 875.6133 946.5487 955.9340 964.1117 992.9604 994.5739 1000.8433 1013.3207 1091.7103 1100.2161 1105.6554 1142.0861 1157.3280 1170.8291 1186.4777 1215.6794 1243.6293 1261.6882 1290.8937 1306.5236 1347.8096 1364.9390 1383.2028 1411.6220 1419.4680 1436.2051 1476.9243 1498.1805 1555.9095 1574.9012 1588.7533 1612.3631 1629.0410 2958.1066 3123.0216 3134.6983 3136.9778 3164.7536 3168.4761 3173.1326 3183.7444 3186.7028 3579.9165
redmass: 4.5143 7.7623 7.3982 6.8473 6.9648 6.3856 5.5549 5.9051 6.7523 5.5196 4.1006 4.7037 1.6236 2.2494 8.0046 2.9473 3.0082 4.7230 3.5160 6.2223 6.9759 2.5950 7.1378 6.9390 7.3250 4.6996 3.7757 4.2383 7.1673 7.1904 1.2680 2.6390 2.7671 1.3432 3.8640 1.5122 1.3630 1.3910 1.5655 1.4953 2.4005 2.9387 1.3488 3.3570 1.4055 1.3304 1.3965 1.5594 1.2906 1.8682 5.3095 2.1651 2.4683 1.3346 1.4332 2.7492 3.7986 3.7796 4.6844 4.3161 3.8918 2.4867 2.8439 6.2787 6.2754 6.9350 6.4798 6.5206 1.0859 1.0901 1.0904 1.0889 1.0892 1.0948 1.0960 1.0945 1.0964 1.0661
irintensity: 1.8544 0.1975 0.3759 0.9281 2.9267 0.6735 3.4568 5.5214 7.3155 2.9257 10.0166 10.1892 104.5310 61.1553 12.3628 0.9043 7.3056 2.5381 0.3018 3.2199 7.5316 39.1367 0.1335 0.6511 4.9095 30.1896 3.9443 0.1998 0.1787 64.3790 6.5829 30.0649 26.2625 22.1246 5.3662 50.0710 6.4208 7.8120 21.0864 0.8684 2.1474 0.7933 0.0518 47.4722 128.3974 14.9093 462.1588 28.0985 77.5024 50.2435 681.6281 34.9359 39.8445 2.0819 3.9321 19.0370 86.3808 39.7056 17.3245 38.7196 4.3815 6.2817 44.4110 253.5739 65.6341 73.5568 46.8128 100.6854 61.0305 25.6965 8.4783 4.5731 1.1614 6.9499 8.6140 0.4240 0.5446 122.6659
temp: 298.150 k
press: 1.00000 atm
elementType: 8 8 8 7 7 6 6 6 6 6 6 6 6 6 6 6 6 6 1 1 1 1 1 1 1 1 1 1
symmnumber: 1
zpe: 534541.0 jmol-1
zpe.correction: 0.203596 hartree
zpe.thermalcorrener: 0.218702 hartree
zpe.thermalcorrenthalpy: 0.219646 hartree
zpe.thermalcorrgfe: 0.159217 hartree
zpe.sumelectzpe: -835.205293 hartree
zpe.sumelectthermal: -835.190187 hartree
zpe.sumelectthermalent: -835.189243 hartree
zpe.sumelectthermalfe: -835.249672 hartree
dipole: 7.6455 0.4063 -0.5736
dipole: 7.6777
quadrupole: -128.5071 -92.1829 -107.0859
quadrupole: -15.3846 -2.1229 1.5732
quadrupole: -19.2484 17.0757 2.1727 -15.3846 -2.1229 1.5732
hfenergy: -835.4088886 hartree
pointgroup: C01 [X(C13H10N2O3)]
dipole: -3.0056043 0.2885793 0.0857165 debye
polarizability: 488.1927259|3.7938308|122.8996992|-7.6800469|-47.9285014|105.3776168 unknown
InChI: InChI=1S/C13H10N2O3/c16-13-7-3-11(4-8-13)14-9-10-1-5-12(6-2-10)15(17)18/h1-9,16H
charge 0 multiplicity 1
28 atoms
O  -6.807855 0.156854 -0.023295
O  6.144071 0.660084 -0.408644
O  5.799303 -1.263006 0.772019
N  -1.178931 -0.256773 0.282149
N  5.370578 -0.219305 0.140405
C  1.128361 0.360173 -0.147281
C  2.026918 1.296995 -0.733468
C  1.655648 -0.774767 0.536857
C  3.907894 -0.019042 0.040656
C  -2.581968 -0.106006 0.15964
C  3.418083 1.115446 -0.644531
C  3.041181 -0.969154 0.634907
C  -0.321721 0.578876 -0.257593
C  -3.2470 0.672052 -0.839381
C  -3.375141 -0.829039 1.093065
C  -4.647509 0.740586 -0.882149
C  -4.77922 -0.752564 1.069134
C  -5.416336 0.03712 0.079176
H  1.627204 2.171802 -1.260005
H  0.948749 -1.482671 0.979138
H  4.125537 1.82173 -1.086324
H  3.469419 -1.830342 1.154352
H  -0.627743 1.497426 -0.80028
H  -2.669036 1.200711 -1.605694
H  -2.857438 -1.440312 1.838362
H  -5.168974 1.319267 -1.650127
H  -5.373353 -1.307908 1.805907
H  -7.266319 -0.372534 0.675902
