program: Gaussian 09
title: 000219797
version: EM64L-G09RevD.01
frameworkgroup: C1[X(C11H21N)]
method: RPBEPBE
basis: SDD
operation: Freq
keyword: #pfreq=noraman
keyword: PBEPBE/SDD
title: #p freq=noraman PBEPBE/SDD
converged: YES YES NO NO
title: Mulliken charges:
elementType: N C C C C C C C C C C C H H H H H H H H H H H H H H H H H H H H H
charge: -0.322814 -0.047890 -0.049728 -0.453656 -0.472511 -0.412062 -0.448751 -0.426363 -0.430831 -0.392918 -0.390660 -0.385121 0.188032 0.202763 0.215964 0.211614 0.207717 0.206798 0.227953 0.178484 0.203880 0.221118 0.174739 0.206179 0.212923 0.211767 0.206433 0.195625 0.188767 0.191835 0.196783 0.197335 0.186597
chargesum: 0.00000
title: Mulliken charges with hydrogens summed into heavy atoms:
elementType: N C C C C C C C C C C C
charge: -0.094861 0.140142 0.153035 -0.026079 -0.057995 -0.029698 -0.052894 -0.007260 -0.012631 -0.008527 -0.002042 -0.001189
polarizability: 1.47189668e+02 7.35080964e-01 1.09936356e+02 -1.71945774e+00 1.49352840e+00 1.05287836e+02
1716.lowfreq: -23.2742 -0.0005 0.0005 0.0006 4.3546 16.9123 35.6180 47.7439 58.4796
frequency: 35.0393 47.5891 58.1224 82.6337 151.7443 177.6526 216.1798 267.0042 303.6629 324.0227 410.3569 430.3276 440.0331 465.5866 536.2330 578.9287 619.0195 670.9250 757.6610 778.5628 788.0354 816.4105 838.2987 862.6601 878.8355 891.1937 891.8207 919.1827 947.8707 958.7012 969.1826 976.2653 1039.0192 1049.2795 1052.0203 1070.8776 1073.7400 1101.4080 1110.5570 1145.3950 1153.4328 1168.2180 1172.7141 1189.5057 1204.3897 1226.9735 1242.6739 1249.6638 1255.1848 1266.2757 1278.3126 1289.4606 1296.2485 1300.2386 1305.1156 1323.0418 1328.8130 1334.2340 1338.7703 1339.2357 1354.3671 1358.1856 1455.4427 1458.1321 1460.9609 1462.3272 1465.0773 1468.4641 1472.4432 1474.8937 1475.7158 1492.1733 2849.5861 2947.6712 2951.1907 2963.0362 2964.7966 2965.4874 2975.2061 2985.4891 2991.7413 2994.6262 3011.7081 3021.4062 3024.8513 3026.8858 3036.3082 3038.4400 3045.2767 3051.4657 3059.3382 3078.4466 3402.6561
redmass: 2.1184 1.9979 3.1185 3.0392 2.6943 2.3871 1.7995 4.0364 2.2154 2.1668 2.2424 2.6310 2.4853 1.7017 2.3967 2.0741 2.8762 1.8387 1.2003 1.6380 1.8690 1.5370 2.1751 3.3797 1.7309 1.6238 2.3351 1.8212 1.7660 1.6792 1.6830 1.5433 1.8067 2.3431 1.3664 1.8173 1.6371 2.3973 2.5125 2.7212 2.3363 1.4787 1.4477 1.5572 1.4790 1.2623 1.2861 1.2582 1.2812 1.2886 1.2481 1.2011 1.3536 1.3080 1.3229 1.4347 1.3157 1.4063 1.4879 1.4401 1.5327 1.4974 1.1924 1.1193 1.0959 1.0875 1.0801 1.0873 1.0877 1.0887 1.0903 1.0998 1.0808 1.0667 1.0652 1.0616 1.0600 1.0668 1.0788 1.0581 1.0595 1.0627 1.0663 1.0962 1.0977 1.0991 1.1004 1.1004 1.0988 1.1028 1.1041 1.1047 1.0734
irintensity: 0.0174 0.0586 0.1871 0.2417 0.7250 0.4699 0.1969 0.4598 1.0525 2.4270 2.3610 1.5814 7.6716 3.5818 7.1634 16.5537 0.6358 68.0968 5.2743 2.9303 2.2774 1.8696 4.7351 0.4939 11.7574 11.6890 3.7110 0.1382 3.6547 1.4603 8.3461 2.5561 2.2870 1.9082 0.7142 3.5821 1.8971 0.7516 0.5118 39.4425 12.8963 4.9771 2.5678 0.9170 4.8433 1.1437 3.0547 7.0099 2.3317 2.2709 0.2675 4.8058 0.8678 1.3259 0.7234 1.0242 2.4194 0.4735 12.0228 0.2448 27.5950 6.5434 3.1564 5.8473 7.0667 9.3204 2.9821 23.5587 10.1851 4.5054 7.5811 4.6503 68.5318 19.2016 29.4646 29.5600 31.2073 32.1090 34.0977 26.5979 31.3348 79.9984 50.2799 87.8648 75.8353 13.6781 54.3233 31.0988 96.0569 9.0563 12.3140 112.1691 2.9234
temp: 298.150 k
press: 1.00000 atm
elementType: 7 6 6 6 6 6 6 6 6 6 6 6 1 1 1 1 1 1 1 1 1 1 1 1 1 1 1 1 1 1 1 1 1
symmnumber: 1
zpe: 794190.8 jmol-1
zpe.correction: 0.302491 hartree
zpe.thermalcorrener: 0.314819 hartree
zpe.thermalcorrenthalpy: 0.315763 hartree
zpe.thermalcorrgfe: 0.262876 hartree
zpe.sumelectzpe: -485.531320 hartree
zpe.sumelectthermal: -485.518992 hartree
zpe.sumelectthermalent: -485.518048 hartree
zpe.sumelectthermalfe: -485.570935 hartree
dipole: -0.2890 0.5925 -0.6783
dipole: 0.9459
quadrupole: -75.4429 -77.3772 -74.9368
quadrupole: 0.5782 -0.1673 1.5385
quadrupole: 0.4761 -1.4582 0.9822 0.5782 -0.1673 1.5385
hfenergy: -485.833811 hartree
pointgroup: C01 [X(C11H21N1)]
dipole: 0.1088333 0.2253136 0.2754685 debye
polarizability: 147.2336566|-0.4264172|110.0186104|-1.2067019|-1.3607549|105.1615933 unknown
InChI: InChI=1S/C11H21N/c1-2-6-10(7-3-1)12-11-8-4-5-9-11/h10-12H,1-9H2
charge 0 multiplicity 1
33 atoms
N  -0.355069 -0.889992 0.224945
C  -1.570638 -0.051004 0.319861
C  0.918253 -0.21695 -0.145294
C  -2.004576 0.550889 -1.042863
C  -2.811932 -0.882313 0.724962
C  1.397193 0.875787 0.85697
C  2.019401 -1.287667 -0.327128
C  -3.521404 0.875439 -0.877044
C  -4.013206 0.025805 0.347193
C  2.739096 1.510424 0.415541
C  3.370044 -0.665018 -0.755722
C  3.832496 0.43161 0.234003
H  -1.463991 0.786906 1.055057
H  0.753923 0.271608 -1.128256
H  -1.846119 -0.226248 -1.815109
H  -1.41662 1.440342 -1.333543
H  -2.811997 -1.169906 1.79337
H  -2.811665 -1.81055 0.120895
H  -0.227341 -1.452742 1.080227
H  1.523926 0.404837 1.856049
H  0.623615 1.66102 0.965898
H  1.674287 -2.033147 -1.067569
H  2.155442 -1.826385 0.63648
H  -4.079955 0.626202 -1.796991
H  -3.680255 1.953218 -0.689505
H  -4.271951 0.68889 1.193943
H  -4.916516 -0.564809 0.112607
H  3.064717 2.269409 1.153566
H  2.591437 2.044134 -0.546798
H  3.259331 -0.218303 -1.765883
H  4.140201 -1.456266 -0.841218
H  4.774819 0.893663 -0.11984
H  4.051453 -0.033184 1.217897
