program: Gaussian 09
title: 000219794
version: EM64L-G09RevD.01
frameworkgroup: C1[X(C8H16O2)]
method: RPBEPBE
basis: SDD
operation: Freq
keyword: #pfreq=noraman
keyword: PBEPBE/SDD
title: #p freq=noraman PBEPBE/SDD
converged: YES YES NO NO
title: Mulliken charges:
elementType: O O C C C C C C C C H H H H H H H H H H H H H H H H
charge: -0.462733 -0.227578 -0.136295 -0.368971 -0.336406 -0.483731 0.142420 -0.348379 -0.698440 -0.686927 0.215022 0.188547 0.213592 0.185808 0.245594 0.236221 0.235977 0.211978 0.230172 0.221279 0.214552 0.203768 0.225961 0.208503 0.207382 0.362680
chargesum: 0.00000
title: Mulliken charges with hydrogens summed into heavy atoms:
elementType: O O C C C C C C C C
charge: -0.100053 -0.227578 0.078728 0.033168 0.094996 -0.011533 0.142420 0.093772 -0.058840 -0.045080
polarizability: 1.12676051e+02 8.17505144e-01 9.05163136e+01 -1.81521186e+00 -4.71469884e+00 7.74974295e+01
1716.lowfreq: -18.6359 -8.9529 -0.0010 -0.0009 -0.0008 6.7529 11.3961 44.9342 74.5463
frequency: 7.2364 44.8921 74.5093 79.5745 91.1647 140.9979 148.3081 227.8189 236.3109 251.1257 306.7007 324.4346 333.9573 382.6369 449.4315 477.1694 577.6743 686.7312 732.8175 743.1049 828.8740 853.7370 872.9259 890.6731 902.3098 957.4844 1018.0979 1047.2615 1056.0293 1059.1674 1084.3346 1113.3100 1123.4003 1141.6696 1206.6918 1222.3441 1228.8072 1268.8340 1278.7279 1290.1788 1299.6319 1311.3260 1345.6694 1354.0796 1375.8611 1390.7484 1395.5588 1428.6392 1447.6403 1471.9759 1475.5334 1477.4088 1480.6068 1484.8802 1486.1684 1606.1836 2951.8729 2968.6593 2971.4083 2972.5300 2976.1843 2977.6377 3001.8904 3009.4262 3029.8390 3047.6217 3048.2691 3071.9816 3074.1276 3076.2230 3076.8189 3406.6795
redmass: 1.7600 3.3406 2.6927 2.3466 2.6795 2.7372 3.3938 1.1502 1.1044 3.1036 3.7654 4.2214 3.0438 3.9156 1.2037 2.8434 1.9826 4.0773 1.2145 1.1642 1.9120 1.4032 2.7925 2.1113 1.6485 2.0897 3.3937 1.7653 1.9428 2.3559 2.3994 2.0464 1.9958 1.8816 1.4569 1.3349 1.3390 1.3099 1.1898 1.2343 1.2823 1.2126 1.4833 1.5921 1.4145 1.2195 1.2177 1.0892 1.0858 1.0555 1.0493 1.0440 1.0426 1.0740 1.0826 8.0050 1.0648 1.0509 1.0436 1.0364 1.0809 1.0677 1.0628 1.0912 1.0960 1.0998 1.1000 1.0989 1.1011 1.1015 1.0991 1.0641
irintensity: 0.0617 0.3050 0.2890 1.0966 1.7741 0.4671 1.3163 0.3923 0.2786 3.7064 3.9930 18.0477 4.3050 7.2476 117.4964 0.8663 3.0057 3.3979 12.0246 4.8075 16.2688 0.1822 3.0906 26.8881 0.2067 9.6549 70.5100 3.7300 11.9536 5.3565 19.7188 8.0231 38.5655 8.5878 18.2829 21.4898 15.8385 8.7514 16.2865 10.2405 32.8783 2.4331 1.5849 55.7632 43.8138 15.0456 11.5477 19.5146 3.3495 5.0469 4.9276 10.6468 13.2690 15.8258 13.5308 85.6155 12.2437 15.8432 36.9262 33.8438 13.9744 50.7681 18.9421 10.9444 24.8300 0.3281 1.5716 49.0478 83.5555 65.1799 52.5191 41.1473
temp: 298.150 k
press: 1.00000 atm
elementType: 8 8 6 6 6 6 6 6 6 6 1 1 1 1 1 1 1 1 1 1 1 1 1 1 1 1
symmnumber: 1
zpe: 593674.0 jmol-1
zpe.correction: 0.226118 hartree
zpe.thermalcorrener: 0.239112 hartree
zpe.thermalcorrenthalpy: 0.240056 hartree
zpe.thermalcorrgfe: 0.184226 hartree
zpe.sumelectzpe: -464.059392 hartree
zpe.sumelectthermal: -464.046399 hartree
zpe.sumelectthermalent: -464.045455 hartree
zpe.sumelectthermalfe: -464.101285 hartree
dipole: 1.1537 -3.1385 0.7841
dipole: 3.4345
quadrupole: -63.5153 -68.4529 -62.6343
quadrupole: 0.7372 3.1132 -0.2232
quadrupole: 1.3522 -3.5854 2.2332 0.7372 3.1132 -0.2232
hfenergy: -464.2855105 hartree
pointgroup: C01 [X(C8H16O2)]
dipole: 0.4468433 1.2693317 -0.1222916 debye
dipolederiv: -0.5190349 -0.1713105 0.1063552 -0.0769781 -0.7419238 -0.1227131 0.0779096 -0.1296995 -0.4322267 -0.6971491 0.0326481 -0.066637 0.0544758 -0.771252 0.167061 -0.1708421 0.2400769 -0.3649199 -0.2679087 0.1815261 -0.1047787 0.2153827 0.4804811 0.0574142 -0.0779339 0.0151286 0.3223571 -0.0265696 0.0859127 0.0040377 -0.0522525 0.0986663 -0.066379 -0.1438661 -0.0618257 0.0438452 0.1207818 -0.0239597 -0.0018762 0.0562389 0.0604898 -0.0550511 0.087555 -0.0811438 0.1215275 -0.2474349 -0.2145081 0.012695 -0.2712434 -0.156494 0.1216471 0.0696796 0.1899232 0.0471584 1.0568269 -0.0343755 0.0796859 0.1024973 0.7137817 -0.290636 0.2162576 -0.3866786 0.1976209 0.1270877 0.0038015 -0.0136527 -0.0485125 0.058034 0.0380267 0.0176276 0.0353266 0.1207699 -0.0559986 0.0860011 0.0397188 0.0542749 0.0619005 -0.0394908 -0.0127908 -0.0247366 0.0461681 -0.0240697 -0.0780204 -0.0017868 -0.0531034 0.0438993 0.0205663 -0.0291243 0.0150201 0.0815992 0.0713413 -0.0303883 0.0083377 -0.0456207 -0.0203499 0.0692971 0.0448298 0.0832553 -0.1115838 -0.0132861 -0.0924693 -0.003548 -0.1333982 -0.1387391 -0.0203263 -0.0013367 0.0094982 0.0643268 0.0408119 0.0272415 -0.0057757 0.0158982 0.0422561 0.0750307 -0.0070869 0.0464719 -0.127621 0.0263555 0.0114934 0.040575 0.0280662 0.0393665 0.0836166 -0.0006102 0.0699461 -0.1825961 0.029247 -0.0584489 -0.0043342 -0.1027589 -0.0649009 -0.0295079 -0.0027789 -0.0137907 0.0759237 0.0560101 -0.0290996 0.021519 -0.0012186 0.0879398 -0.0184594 -0.0267083 -0.0181599 -0.095012 0.0079561 0.0859838 0.0013642 0.1202019 -0.0512965 -0.0102935 -0.0303016 -0.0577712 0.0908503 0.0206112 -0.0202366 0.0659189 -0.0105683 0.0725605 -0.0078142 0.0297918 -0.0056926 -0.1530569 0.0252439 0.0475997 0.0045995 0.0852101 -0.0982685 -0.0177612 -0.0006591 -0.0365667 0.0785466 -0.2017272 0.0718687 -0.0526751 0.0619428 0.0734297 -0.0089794 -0.0698487 -0.0010999 0.0636033 0.1003338 0.0097115 -0.0098586 -0.0018907 0.0365588 0.1038442 0.0425907 0.0591648 -0.1514201 0.0415841 -0.1348537 -0.004337 -0.0679524 -0.1483987 -0.0401058 0.0211037 -0.018124 0.0716098 -0.1552644 -0.0350046 -0.1064299 -0.0096326 0.0794679 0.0175183 -0.133911 0.0010725 0.0279761 0.0785095 -0.0106149 0.0353838 -0.0104482 0.0675474 -0.0343677 0.09347 0.0037855 -0.1708328 0.0372604 0.1242051 0.027554 0.0533584 -0.1436098 -0.0257264 0.032858 -0.0289645 0.0810208 0.3684819 0.1652967 -0.0720547 0.0380312 0.3188536 0.0335895 -0.0258749 0.0955839 0.2543656 unknown
polarizability: 112.7423715|-1.0797449|91.647381|0.8024879|-2.4422989|76.3000413 unknown
InChI: InChI=1S/C8H16O2/c1-3-5-7(9)8(10)6-4-2/h7,9H,3-6H2,1-2H3
charge 0 multiplicity 1
26 atoms
O  -1.444433 -1.844469 -0.618499
O  1.018377 -1.757981 0.391018
C  -0.79259 -0.541305 -0.640684
C  -1.56724 0.464542 0.260357
C  -3.026466 0.642277 -0.213816
C  1.643332 0.450316 -0.462145
C  0.671177 -0.684831 -0.182405
C  2.965195 0.369796 0.328714
C  -3.840702 1.559661 0.722425
C  3.95359 1.481909 -0.078963
H  -0.809295 -0.169146 -1.686166
H  -1.054557 1.448066 0.257023
H  -1.554481 0.084271 1.301162
H  -3.026727 1.060381 -1.241489
H  -3.495295 -0.356551 -0.277949
H  1.856774 0.423054 -1.554078
H  1.137202 1.421741 -0.292552
H  2.744818 0.435706 1.411314
H  3.418949 -0.625546 0.171186
H  -4.877802 1.679937 0.35913
H  -3.88963 1.139934 1.7450
H  -3.389191 2.56791 0.793959
H  4.889397 1.413868 0.504597
H  4.220059 1.407422 -1.150587
H  3.524005 2.487588 0.091394
H  -0.844068 -2.446649 -0.091046
