program: Gaussian 09
title: 000219788
version: EM64L-G09RevD.01
frameworkgroup: C1[X(C12H22O2)]
method: RPBEPBE
basis: SDD
operation: Freq
keyword: #pfreq=noraman
keyword: PBEPBE/SDD
title: #p freq=noraman PBEPBE/SDD
converged: YES YES NO NO
title: Mulliken charges:
elementType: O O C C C C C C C C C C C C H H H H H H H H H H H H H H H H H H H H H H
charge: -0.488203 -0.488203 0.310203 0.310203 -0.501741 -0.501559 -0.501557 -0.501743 -0.432072 -0.432231 -0.432250 -0.432052 -0.382834 -0.382834 0.222620 0.237964 0.237999 0.222532 0.222560 0.237975 0.237990 0.222592 0.180902 0.208409 0.208337 0.181142 0.181154 0.208330 0.208415 0.180890 0.198342 0.202941 0.198343 0.202941 0.327247 0.327248
chargesum: 0.00000
title: Mulliken charges with hydrogens summed into heavy atoms:
elementType: O O C C C C C C C C C C C C
charge: -0.160955 -0.160955 0.310203 0.310203 -0.041156 -0.041028 -0.041023 -0.041162 -0.042761 -0.042752 -0.042766 -0.042746 0.018449 0.018450
polarizability: 1.56628278e+02 -1.10160409e-02 1.20601802e+02 -5.85548209e-01 -9.40961982e-04 1.11929679e+02
1716.lowfreq: -10.9557 -0.0011 -0.0010 -0.0009 10.9767 21.5313 61.2728 75.3677 124.6090
frequency: 61.2728 75.3677 124.5981 150.6583 184.1560 193.5193 208.1864 221.3419 254.6144 264.5295 283.8027 300.4202 307.5279 345.2751 380.4006 389.6520 419.4745 474.9571 476.3687 480.9366 484.9516 497.4450 636.4338 678.2213 769.1283 769.8019 772.9777 829.0953 834.7447 846.4661 856.7595 902.5444 917.5911 919.7636 921.8608 925.4401 928.5790 950.8185 996.4810 1036.7904 1051.4131 1055.5322 1067.6272 1068.9362 1096.3856 1099.6358 1119.9980 1131.7576 1137.5195 1164.7860 1195.5114 1198.7362 1232.8277 1236.2814 1254.3017 1268.8254 1273.4063 1273.5181 1278.9176 1297.7212 1313.4223 1322.9206 1333.8076 1335.9581 1338.9968 1346.6991 1347.1455 1351.6021 1359.1346 1380.6113 1449.7711 1454.9258 1455.0325 1458.0629 1468.2023 1470.4359 1471.0536 1471.1500 1482.2225 1482.4125 2944.2125 2944.3392 2946.1581 2946.4839 2970.2386 2970.3050 2996.4115 2999.5079 3000.1439 3003.7657 3023.6113 3024.5364 3028.2016 3029.0793 3035.3682 3035.7412 3061.0699 3066.6630 3068.1524 3071.3898 3572.2541 3572.9168
redmass: 3.6796 2.9828 2.7544 3.0882 1.2453 1.1552 1.7751 1.8302 3.7607 4.4648 2.9710 2.3936 2.6889 1.9246 1.8349 2.7530 3.0427 1.8625 3.4473 3.3220 3.3588 1.7492 2.2328 3.2142 4.1645 1.4630 1.5099 2.2595 1.7825 2.6506 1.6651 2.3641 2.9876 1.7789 1.6761 1.9828 1.5696 2.4473 2.2780 2.0050 1.7534 1.4191 1.8790 1.2811 1.5300 1.4195 1.9517 1.6833 1.6834 2.6691 1.6154 1.4074 1.9312 1.3473 1.2621 1.2690 1.4810 1.3886 1.2255 1.4681 1.4926 1.3825 1.4453 1.3650 1.4760 1.5160 1.4945 1.7183 1.4950 1.6174 1.0862 1.0838 1.0868 1.0880 1.0832 1.0831 1.0859 1.0862 1.0888 1.0904 1.0671 1.0672 1.0672 1.0675 1.0611 1.0613 1.0614 1.0620 1.0617 1.0627 1.0920 1.0907 1.0903 1.0896 1.1030 1.1023 1.1028 1.1023 1.1015 1.1014 1.0652 1.0653
irintensity: 6.5185 0.5860 0.0000 0.9277 0.0000 212.7004 0.0000 16.5863 13.4967 0.0000 0.0000 2.6062 0.0000 0.0000 1.6642 2.4266 0.0000 1.6192 8.7622 0.0001 0.0000 0.0000 14.0768 0.0000 39.3705 0.0006 0.8356 10.8461 0.0000 0.0000 27.8670 1.1485 62.0005 0.0008 0.0000 0.0008 36.9223 0.0000 8.1529 0.0000 1.2073 3.0037 0.0000 0.0000 2.5626 0.0000 101.7945 0.0000 7.8658 0.0000 7.0444 75.6076 0.0000 0.0000 11.6653 0.0000 0.0149 0.0003 0.0644 0.0000 0.0000 5.7983 0.0000 0.0299 0.0000 6.1226 18.6740 0.0000 45.8598 0.0000 9.9584 0.0000 0.0000 9.9698 0.0000 33.2370 12.7118 0.0003 22.5671 0.0000 0.0037 39.3246 128.6769 0.0005 68.6009 0.0288 0.0006 49.3233 12.5481 0.0000 0.0001 158.9670 107.3863 0.0001 113.0609 0.0001 0.0002 81.6417 34.0433 0.0002 0.0003 2.4123
temp: 298.150 k
press: 1.00000 atm
elementType: 8 8 6 6 6 6 6 6 6 6 6 6 6 6 1 1 1 1 1 1 1 1 1 1 1 1 1 1 1 1 1 1 1 1 1 1
symmnumber: 1
zpe: 843251.9 jmol-1
zpe.correction: 0.321178 hartree
zpe.thermalcorrener: 0.335627 hartree
zpe.thermalcorrenthalpy: 0.336571 hartree
zpe.thermalcorrgfe: 0.281596 hartree
zpe.sumelectzpe: -619.781739 hartree
zpe.sumelectthermal: -619.767290 hartree
zpe.sumelectthermalent: -619.766345 hartree
zpe.sumelectthermalfe: -619.821320 hartree
dipole: 0.0000 0.0000 0.0000
dipole: 0.0000
quadrupole: -79.5957 -86.8147 -89.0869
quadrupole: -0.0183 3.9451 -0.0104
quadrupole: 5.5701 -1.6489 -3.9211 -0.0183 3.9451 -0.0104
hfenergy: -620.1029167 hartree
pointgroup: C01 [X(C12H22O2)]
dipole: 0.0000016 -0.0000128 0. debye
polarizability: 156.6347378|-0.1811355|120.5988412|-0.1153571|0.1837636|111.9261799 unknown
InChI: InChI=1S/C12H22O2/c13-11(7-3-1-4-8-11)12(14)9-5-2-6-10-12/h13-14H,1-10H2
charge 0 multiplicity 1
36 atoms
O  0.605432 -0.069603 1.73102
O  -0.668042 0.007334 -1.728784
C  0.718469 -0.03994 0.244102
C  -0.781077 -0.021911 -0.241858
C  1.481375 1.238601 -0.200689
C  1.467442 -1.307509 -0.252679
C  -1.529857 1.2459 0.254584
C  -1.54417 -1.300222 0.203284
C  2.983962 1.215312 0.174587
C  2.970411 -1.31556 0.12164
C  -3.032819 1.254079 -0.119755
C  -3.046768 -1.276806 -0.17195
C  3.690506 -0.042994 -0.375926
C  -3.753108 -0.018224 0.378198
H  1.007487 2.123383 0.26112
H  1.372203 1.334023 -1.296995
H  1.356528 -1.35689 -1.351872
H  0.98423 -2.205054 0.173345
H  -1.046486 2.143251 -0.171674
H  -1.41894 1.295561 1.353762
H  -1.434984 -1.395372 1.299614
H  -1.070448 -2.185205 -0.258307
H  3.103196 1.247967 1.279919
H  3.468465 2.133717 -0.208691
H  3.444896 -2.222093 -0.300562
H  3.089929 -1.396337 1.224509
H  -3.152308 1.334541 -1.222648
H  -3.507167 2.160809 0.302178
H  -3.531402 -2.195024 0.21161
H  -3.166047 -1.309774 -1.27727
H  3.666854 -0.019471 -1.484607
H  4.755569 -0.055198 -0.073391
H  -3.729447 -0.041423 1.486885
H  -4.818173 -0.005943 0.075672
H  1.521379 -0.080327 2.106367
H  -1.583991 0.017703 -2.104139
